program: Gaussian 09
title: 000156380
version: EM64L-G09RevD.01
frameworkgroup: C1[X(C9H12O3)]
method: RPBEPBE
basis: SDD
operation: Freq
keyword: #pfreq=noraman
keyword: PBEPBE/SDD
title: #p freq=noraman PBEPBE/SDD
converged: YES YES NO NO
title: Mulliken charges:
elementType: O O O C C C C C C C C C H H H H H H H H H H H H
charge: -0.217585 -0.426960 -0.303197 -0.033764 -0.509248 -0.695632 -0.687812 0.252012 0.034732 0.126545 -0.147257 -0.267856 0.206510 0.251653 0.223773 0.220593 0.212921 0.212876 0.228377 0.214947 0.209690 0.255251 0.258834 0.380598
chargesum: 0.00000
title: Mulliken charges with hydrogens summed into heavy atoms:
elementType: O O O C C C C C C C C C
charge: -0.217585 -0.046362 -0.303197 0.172746 -0.033822 -0.049243 -0.034798 0.252012 0.034732 0.126545 0.107993 -0.009021
polarizability: 1.34868668e+02 6.66887624e+00 1.16366454e+02 1.32672357e+01 -9.13914371e-01 7.15900439e+01
1716.lowfreq: 0.0005 0.0006 0.0008 2.8205 10.0740 14.6722 34.4599 75.2349 81.7449
frequency: 33.8922 75.0687 81.7311 150.9472 207.8171 209.4217 225.6064 239.9613 301.2915 308.5031 363.0428 368.5972 439.3921 472.2190 493.9602 508.3555 539.1048 623.7179 669.3064 696.1805 733.9575 775.5266 813.8635 819.5111 844.5058 919.4913 920.9109 945.3849 959.3397 977.6475 998.8370 1081.6333 1103.1903 1159.1194 1186.5509 1211.6755 1237.5034 1246.1680 1271.5001 1287.8395 1328.7257 1355.9687 1361.2811 1384.9718 1391.7515 1403.1938 1445.2682 1464.1820 1472.5638 1482.6507 1485.9457 1512.3843 1599.2895 1662.1531 2969.5032 2975.8241 2979.0939 2996.4899 3062.7524 3069.2080 3072.8065 3076.6772 3083.0116 3181.5223 3211.1194 3266.0371
redmass: 3.2469 4.0267 3.6929 6.0302 1.5030 3.1497 2.2451 1.0819 5.7275 4.8189 1.9463 2.0887 3.2609 6.6468 5.0733 4.7995 6.6959 4.8896 1.1159 3.9238 4.1053 3.4291 1.6366 4.9585 2.1186 1.2834 1.2477 1.9117 1.6185 2.3267 2.8831 1.8076 1.6635 2.8184 2.0824 2.2384 2.1606 1.3369 1.3718 1.6197 1.5536 1.4005 1.5733 1.2152 4.0896 1.2537 1.1318 1.0453 1.0541 1.0464 1.0541 6.8613 6.5841 7.0967 1.0807 1.0358 1.0363 1.0628 1.1009 1.0998 1.0997 1.0992 1.0995 1.0885 1.1011 1.0626
irintensity: 0.6160 0.0659 0.8446 1.2929 1.3874 3.6242 1.6487 0.2939 21.6064 2.8638 0.2235 0.5002 1.9892 1.3048 3.4554 7.2379 0.0576 4.3051 111.3066 2.1890 5.6777 0.8570 63.5440 35.1006 4.4065 1.8395 10.6990 12.2781 1.9208 31.3498 2.4211 3.5384 6.4908 70.5727 10.5643 61.8526 79.4870 25.7703 32.4712 106.5873 1.5919 35.3922 14.4594 23.0561 89.1573 16.0687 10.2559 1.6512 2.5605 23.3189 13.2358 62.7940 180.4852 75.9887 27.1281 30.2293 22.7052 28.2419 3.6090 6.1755 47.4389 89.0959 35.4886 0.1144 3.2364 75.9824
temp: 298.150 k
press: 1.00000 atm
elementType: 8 8 8 6 6 6 6 6 6 6 6 6 1 1 1 1 1 1 1 1 1 1 1 1
symmnumber: 1
zpe: 507196.6 jmol-1
zpe.correction: 0.193181 hartree
zpe.thermalcorrener: 0.205172 hartree
zpe.thermalcorrenthalpy: 0.206116 hartree
zpe.thermalcorrgfe: 0.154901 hartree
zpe.sumelectzpe: -574.892078 hartree
zpe.sumelectthermal: -574.880087 hartree
zpe.sumelectthermalent: -574.879143 hartree
zpe.sumelectthermalfe: -574.930358 hartree
dipole: 2.3332 2.7565 0.3948
dipole: 3.6329
quadrupole: -77.1206 -68.0394 -72.3273
quadrupole: -7.8203 -0.2017 -1.5368
quadrupole: -4.6248 4.4564 0.1685 -7.8203 -0.2017 -1.5368
hfenergy: -575.0852591 hartree
pointgroup: C01 [X(C9H12O3)]
dipole: 0.8266927 -1.1657853 -0.0213381 debye
dipolederiv: -0.764392 -0.0377588 0.1982856 0.0895737 -0.5716986 0.0450192 0.1927901 0.0701343 -0.183081 -0.2238753 -0.1927041 -0.0287897 0.0183892 -1.0540739 0.1416121 -0.0879766 0.1845813 -0.4010955 -0.8903712 0.3127448 0.0717044 0.5001794 -0.8474372 -0.0599158 0.0899085 -0.0325573 -0.3935313 0.3107634 0.0061524 0.0261386 0.0088795 0.1661531 -0.0097441 0.2271853 -0.0223837 0.1691892 -0.1902633 -0.0472285 0.0064095 -0.0129858 0.0139828 0.0132807 -0.1421239 0.0689058 0.0431221 0.0323763 0.0159811 -0.0330715 -0.0058075 -0.0538246 0.0621125 -0.0751324 0.0589986 0.0080135 0.0259157 0.0159939 -0.0131257 0.0397244 -0.0606478 -0.0622916 -0.0355748 -0.044627 -0.0073223 0.7731521 0.1915795 -0.2159373 -0.2507257 0.355399 0.0084756 -0.2665452 -0.1308004 -0.0194215 -0.7349199 0.2102025 0.1532854 0.062013 0.8626305 -0.1613887 0.2989962 -0.1920128 0.0516988 1.008255 -0.5064587 -0.1077437 -0.4673635 0.8219269 0.0559272 -0.1896338 0.0775238 0.2159741 0.6568902 -0.0714942 -0.2099824 -0.15442 0.2787264 0.0135584 -0.2034057 -0.0170653 0.0435396 -0.0812253 0.0341472 -0.0468851 0.3165707 -0.4643354 -0.0736586 -0.0797358 0.0242003 -0.1611214 -0.2003635 -0.021714 0.109103 -0.039361 0.0223416 0.0255875 0.0672463 0.0269928 -0.0443008 0.0248705 0.0252442 -0.019881 0.0038885 -0.0142953 0.1142771 0.0095493 0.0577462 0.0435114 0.013525 0.0117327 0.0262167 0.0186606 -0.0312283 -0.1447272 0.0463414 -0.0971972 0.0049976 -0.0572631 -0.0536417 0.1272829 -0.0120531 0.0573773 0.0202947 0.1318783 0.0271037 0.0161319 -0.1030418 0.0156194 -0.1391834 -0.0224376 0.0794847 -0.0103281 -0.1629718 0.0206119 -0.0259545 0.1013983 0.0219503 0.0193739 0.0382667 -0.1015076 -0.0943623 0.0522494 -0.1380206 -0.0189188 0.1073002 0.054848 -0.0066189 0.0342528 -0.0962067 0.0722035 0.0093572 0.1083556 0.0198024 -0.0632941 -0.0136385 0.1296712 -0.0480473 0.0440408 0.0324826 0.1288155 0.0063157 0.0158805 -0.0967945 -0.0468587 -0.1409005 -0.0134117 0.0862894 -0.0250417 -0.1517469 -0.0532111 -0.0330522 0.091394 -0.005108 0.0267406 -0.0234557 -0.0197557 0.0317153 0.0344987 0.030011 0.1623997 0.0106714 -0.0596811 0.0576018 -0.0213478 0.0842371 0.0186144 0.0565551 0.0341553 0.1475204 0.249292 0.1400903 0.010306 -0.0589816 0.4424213 -0.0137027 0.0494756 -0.0677612 0.3460182 unknown
polarizability: 134.565883|-9.0555555|117.283264|-9.9835841|-4.1361104|70.9760192 unknown
InChI: InChI=1S/C9H12O3/c1-6(2)5-8-9(11)7(10)3-4-12-8/h3-4,6,11H,5H2,1-2H3
charge 0 multiplicity 1
24 atoms
O  -0.123031 -1.55532 -0.269784
O  -0.536521 2.093319 -0.658118
O  -2.959842 1.424593 0.246154
C  2.708024 0.107601 0.020974
C  1.594125 -0.010524 -1.07577
C  2.898477 -1.209121 0.808908
C  2.454962 1.300582 0.971558
C  0.199453 -0.209831 -0.564131
C  -0.768186 0.756158 -0.378009
C  -2.126806 0.449926 0.1147
C  -1.384561 -1.882633 0.199255
C  -2.376747 -0.952782 0.400449
H  3.644949 0.308254 -0.540012
H  1.591284 0.918291 -1.674946
H  1.845894 -0.852026 -1.74988
H  2.003396 -1.446856 1.412196
H  3.757983 -1.124723 1.499578
H  3.084449 -2.06381 0.13231
H  2.312234 2.241967 0.411395
H  1.54737 1.135442 1.581692
H  3.306996 1.432162 1.663934
H  -1.471628 -2.955937 0.376752
H  -3.356686 -1.263646 0.770079
H  -1.410287 2.553012 -0.446083
