program: Gaussian 09
title: 000156377
version: EM64L-G09RevD.01
frameworkgroup: C1[X(C12H24O)]
method: RPBEPBE
basis: SDD
operation: Freq
keyword: #pfreq=noraman
keyword: PBEPBE/SDD
title: #p freq=noraman PBEPBE/SDD
converged: YES YES NO NO
title: Mulliken charges:
elementType: O C C C C C C C C C C C C H H H H H H H H H H H H H H H H H H H H H H H H
charge: -0.194960 0.014120 -0.436720 -0.418944 -0.401625 0.012670 -0.402636 -0.396442 -0.758220 -0.752777 -0.465338 -0.717922 -0.070944 0.184085 0.197417 0.196554 0.207711 0.214751 0.188997 0.195065 0.191859 0.218871 0.219322 0.196550 0.198343 0.216632 0.211641 0.217563 0.210875 0.218409 0.211867 0.241354 0.226204 0.224803 0.220974 0.212500 0.167391
chargesum: 0.00000
title: Mulliken charges with hydrogens summed into heavy atoms:
elementType: O C C C C C C C C C C C C
charge: -0.194960 0.198205 -0.042749 0.003518 -0.017562 0.204528 0.035557 -0.001550 -0.112384 -0.111626 0.002220 -0.059645 0.096448
polarizability: 1.56679962e+02 -2.41499498e+00 1.25717213e+02 -2.28736597e+00 8.09156122e-01 1.12004502e+02
1716.lowfreq: -12.7428 -0.0004 0.0005 0.0007 3.9349 6.3511 28.9092 44.3940 48.4284
frequency: 28.3899 42.2395 47.6030 62.9256 80.8932 84.9474 103.0773 124.3095 155.4313 164.8446 185.8045 214.3815 227.9973 243.4245 265.7727 274.3917 308.3255 353.0262 376.6750 394.9025 428.5120 528.5486 587.7777 657.1160 667.7240 734.8172 773.2695 782.8302 821.0672 823.6267 842.7777 896.3575 903.4504 943.5099 953.5410 974.3980 979.5530 985.9890 1005.1037 1021.1805 1055.7954 1065.6331 1075.7674 1097.9742 1125.5742 1136.8015 1163.2869 1170.6540 1194.0690 1203.6705 1230.5747 1251.3810 1271.3583 1276.2466 1276.3384 1290.2301 1299.5675 1314.6524 1335.2202 1340.0136 1343.6192 1352.6943 1357.4533 1363.5141 1379.2447 1387.7757 1389.1307 1395.1619 1424.9935 1456.1182 1458.0243 1463.8630 1467.6753 1476.4338 1478.9567 1480.4600 1482.4814 1486.5726 1487.1133 1495.1712 1644.9662 2846.6413 2934.8371 2940.4459 2945.0895 2947.6806 2957.0435 2966.4705 2972.5508 2974.1833 2974.8607 2982.5017 2987.8656 2990.6052 2995.8207 3002.7978 3013.6106 3043.0113 3049.9212 3064.8254 3065.6921 3069.2441 3070.5752 3072.1841 3080.3602
redmass: 4.4967 3.3535 3.2295 2.5594 2.4651 2.6297 1.9252 2.2577 2.7166 1.7121 2.2081 1.0847 1.1692 3.2006 1.4542 2.5707 2.7012 2.1799 2.1947 2.2261 2.3567 2.5282 2.5976 1.9814 1.7553 1.1323 1.3277 2.1442 1.7234 1.4852 1.6742 2.3665 2.2185 1.5500 1.3907 1.6799 1.7339 1.9069 1.6485 1.4990 1.5221 2.3147 2.2965 1.9726 2.2243 1.8831 1.8892 1.8514 1.6900 1.6064 1.2892 1.3381 1.1506 1.1643 1.2038 1.4838 1.1056 1.5716 1.4466 1.4471 1.4207 1.4051 1.5397 1.4729 1.2306 1.2257 1.2261 1.2100 1.1032 1.0719 1.0777 1.0700 1.0845 1.0597 1.0727 1.0508 1.0636 1.0545 1.0567 1.0515 7.4330 1.0837 1.0758 1.0759 1.0633 1.0623 1.0654 1.0625 1.0545 1.0365 1.0422 1.0378 1.0888 1.0650 1.0959 1.1015 1.1011 1.1039 1.1017 1.0990 1.0988 1.0990 1.0987 1.0989 1.0995
irintensity: 3.7267 1.0791 3.3387 0.7972 0.5136 0.8400 0.1111 0.5911 4.8480 1.1407 2.3507 0.0571 0.0163 1.2081 0.5484 0.3538 0.1618 3.2491 0.0304 0.3320 1.0117 0.5300 12.7817 9.1856 7.5811 5.5445 6.4965 1.8110 3.3675 0.8416 1.1412 5.2512 4.2518 1.2630 1.3886 2.1873 0.4618 0.7016 3.4346 9.1239 2.6748 0.4704 1.7847 0.4177 2.9784 2.1861 6.2879 5.8933 0.2862 3.9197 11.0234 28.4774 2.3572 0.4357 3.1833 6.1706 2.6943 5.5466 1.5633 2.8298 5.9448 4.1317 0.1152 2.6024 9.5770 3.9290 36.4507 22.6125 28.0104 1.8198 1.4965 2.4709 4.6242 6.3798 2.8531 26.2298 7.0858 12.6477 15.5046 3.0465 114.6292 174.4900 19.7142 8.1667 41.2453 22.2686 64.8983 62.9049 26.2126 11.0497 59.5198 22.5156 7.8298 16.7329 29.4722 1.7790 27.5409 104.3410 27.7200 42.3171 64.5677 64.9554 66.5749 40.2963 53.7979
temp: 298.150 k
press: 1.00000 atm
elementType: 8 6 6 6 6 6 6 6 6 6 6 6 6 1 1 1 1 1 1 1 1 1 1 1 1 1 1 1 1 1 1 1 1 1 1 1 1
symmnumber: 1
zpe: 875939.0 jmol-1
zpe.correction: 0.333628 hartree
zpe.thermalcorrener: 0.350775 hartree
zpe.thermalcorrenthalpy: 0.351719 hartree
zpe.thermalcorrgfe: 0.287267 hartree
zpe.sumelectzpe: -545.796338 hartree
zpe.sumelectthermal: -545.779191 hartree
zpe.sumelectthermalent: -545.778247 hartree
zpe.sumelectthermalfe: -545.842699 hartree
dipole: -0.3274 2.8655 -0.1470
dipole: 2.8878
quadrupole: -79.6200 -92.7933 -83.4542
quadrupole: -12.9015 0.3718 0.1316
quadrupole: 5.6691 -7.5041 1.8350 -12.9015 0.3718 0.1316
hfenergy: -546.129966 hartree
pointgroup: C01 [X(C12H24O1)]
dipole: -0.1197336 1.1297555 -0.0136103 debye
polarizability: 156.6314663|-2.5711486|125.6727236|-2.4525039|1.3651238|112.0974871 unknown
InChI: InChI=1S/C12H24O/c1-4-11(2)7-5-8-12(3)9-6-10-13/h10-12H,4-9H2,1-3H3
charge 0 multiplicity 1
37 atoms
O  -4.289774 -2.231851 0.055795
C  -1.650208 1.313032 -0.453928
C  -0.197403 1.028049 -0.934672
C  0.714077 0.28251 0.069084
C  2.140104 0.066151 -0.489472
C  3.080473 -0.745649 0.44322
C  -2.431043 -0.003656 -0.196233
C  4.373262 -1.201531 -0.295833
C  -1.675671 2.259756 0.772711
C  3.407695 0.018119 1.750946
C  -3.941322 0.207304 0.013664
C  5.289196 -0.059152 -0.793257
C  -4.755591 -1.068956 0.12373
H  -2.158637 1.840379 -1.292036
H  -0.243327 0.439819 -1.8754
H  0.282472 1.9949 -1.195892
H  0.274239 -0.704188 0.318517
H  0.768814 0.854846 1.015437
H  2.061735 -0.46262 -1.463506
H  2.595879 1.05447 -0.707268
H  2.536578 -1.673847 0.72679
H  -2.015428 -0.525262 0.686795
H  -2.285324 -0.692419 -1.051249
H  4.955074 -1.857169 0.384065
H  4.080982 -1.830367 -1.161941
H  -1.290307 1.754468 1.678016
H  -2.698439 2.614459 0.997543
H  -1.049262 3.153167 0.591775
H  3.863713 1.003266 1.537187
H  2.500037 0.194634 2.355723
H  4.118151 -0.555175 2.37605
H  -4.150872 0.804451 0.927233
H  -4.380838 0.803199 -0.81796
H  4.767378 0.594538 -1.515596
H  5.641262 0.572353 0.042476
H  6.182856 -0.46826 -1.299693
H  -5.856328 -0.907569 0.275877
