program: Gaussian 09
title: 000156375
version: EM64L-G09RevD.01
frameworkgroup: C1[X(C12H18IN)]
method: RPBEPBE
basis: SDD
operation: Freq
keyword: #p
keyword: freq=noraman
keyword: PBEPBE/SDD
title: #p freq=noraman PBEPBE/SDD
converged: YES YES NO NO
title: Mulliken charges:
elementType: I N C C C C C C C C C C C C H H H H H H H H H H H H H H H H H H
charge: 0.087764 -0.304717 -0.069577 -0.602809 -0.027556 -0.710010 0.515310 -0.681620 -0.711412 -0.418243 -0.387186 -0.163429 -0.167768 -0.351658 0.220120 0.197703 0.238275 0.179359 0.237123 0.221126 0.196274 0.239841 0.208365 0.223886 0.212985 0.204398 0.211230 0.226502 0.239041 0.242736 0.246906 0.247041
chargesum: 0.00000
title: Mulliken charges with hydrogens summed into heavy atoms:
elementType: I N C C C C C C C C C C C C
charge: 0.087764 -0.067594 0.150544 -0.166830 0.151803 -0.052770 0.515310 -0.036385 -0.069282 -0.179202 -0.144449 0.083477 0.079273 -0.351658
polarizability: 2.48156677e+02 -7.58897764e+00 1.36428106e+02 1.53769487e+01 5.58855401e+00 9.73298963e+01
1716.lowfreq: -13.0645 -2.1896 -0.0004 0.0003 0.0003 4.4521 12.8749 27.6690 31.3676
frequency: -5.8459 27.5357 31.2559 47.5839 98.7411 117.1224 150.5461 177.3673 203.3640 216.1448 227.8388 244.1526 276.0878 305.4411 358.5914 363.9643 390.7866 404.5045 417.2758 458.3218 485.0368 534.0334 613.7036 625.1744 649.5409 715.9345 786.7725 815.6395 834.9770 839.3402 850.3799 895.1442 915.3111 921.8711 951.6475 953.8695 969.9192 991.1547 995.2244 1049.3936 1055.1800 1083.7529 1110.4622 1124.2196 1154.5446 1160.7851 1183.9232 1190.0603 1211.3783 1216.6613 1274.8887 1296.2980 1318.5490 1322.1597 1337.8126 1345.4874 1368.8185 1373.7797 1380.0540 1387.4636 1389.1427 1449.7309 1465.4520 1466.4683 1467.9819 1471.3592 1474.4070 1478.9796 1481.5363 1491.8389 1574.3244 1594.3561 2859.3337 2967.7394 2972.5842 2975.8731 2980.2672 3003.1436 3044.9454 3064.0359 3065.2735 3075.0257 3075.2372 3082.9346 3089.9486 3124.3051 3128.5437 3165.7078 3169.3658 3402.8377
redmass: 2.6332 4.1700 4.0410 3.8089 2.8644 4.7572 4.3476 3.2914 1.2084 1.2947 2.3482 1.1501 3.2797 4.7460 2.4961 2.6173 2.2756 2.8510 2.1813 2.6108 2.1181 2.8812 4.4386 6.8431 1.7712 3.4527 2.9117 1.7618 1.2693 2.8892 2.0268 1.3619 1.3598 1.5061 1.4436 1.3571 1.3796 5.3861 1.8889 1.6002 2.4951 2.9114 1.5730 1.7377 2.0348 2.2068 2.0190 1.1062 1.4815 2.5369 1.2612 1.2668 1.4112 1.3441 1.3974 1.3879 5.6928 1.2599 1.2178 1.2144 2.4413 1.1179 1.0755 1.0841 2.1320 1.0835 1.0728 1.0923 1.0983 1.0633 7.0815 6.1735 1.0813 1.0368 1.0362 1.0626 1.0358 1.0815 1.0999 1.0984 1.0981 1.0989 1.0990 1.1006 1.0998 1.0897 1.0895 1.0947 1.0956 1.0734
irintensity: 0.1087 0.0541 0.0320 0.2584 1.1004 0.2590 0.5614 0.5066 0.2125 0.0482 0.9089 0.2264 1.6465 1.1094 0.0841 3.5912 1.3759 0.0092 3.1214 1.4060 30.5772 30.0611 14.6991 0.3300 62.9621 3.6859 13.2232 48.4664 0.2566 7.3602 17.6469 6.3717 1.0660 6.6992 0.5563 0.1165 0.1568 62.1306 1.2354 2.5649 15.4026 10.9389 9.1195 11.5220 70.3395 28.9431 27.1806 1.9464 18.2301 1.3164 16.7542 0.5727 13.9497 11.6542 34.7242 0.8847 1.1502 23.7573 25.8643 23.0237 9.2808 28.8383 1.2262 14.5855 72.4029 4.8284 1.7106 10.6140 7.0203 17.7700 0.1369 5.0722 84.8343 22.3890 39.1157 27.7052 13.6255 22.2414 16.6247 6.7861 69.4797 102.8717 6.6006 4.2538 70.8398 10.3394 13.8575 13.2952 0.2383 3.4490
temp: 298.150 k
press: 1.00000 atm
elementType: 53 7 6 6 6 6 6 6 6 6 6 6 6 6 1 1 1 1 1 1 1 1 1 1 1 1 1 1 1 1 1 1
symmnumber: 1
zpe: 710938.6 jmol-1
zpe.correction: 0.270782 hartree
zpe.thermalcorrener: 0.285826 hartree
zpe.thermalcorrenthalpy: 0.286771 hartree
zpe.thermalcorrgfe: 0.226191 hartree
zpe.sumelectzpe: -533.246916 hartree
zpe.sumelectthermal: -533.231872 hartree
zpe.sumelectthermalent: -533.230928 hartree
zpe.sumelectthermalfe: -533.291508 hartree
dipole: -2.6461 0.7664 0.5263
dipole: 2.8047
quadrupole: -99.3306 -93.9400 -105.3476
quadrupole: -2.3437 -2.1869 1.1084
quadrupole: 0.2088 5.5994 -5.8082 -2.3437 -2.1869 1.1084
hfenergy: -533.5176984 hartree
pointgroup: C01 [X(C12H18I1N1)]
dipole: -1.0444918 -0.3515001 -0.0555042 debye
polarizability: 245.8440845|2.9248561|136.3250688|-25.0031475|-6.2285914|99.7455257 unknown
InChI: InChI=1S/C12H18IN/c1-9(2)14-10(3)8-11-4-6-12(13)7-5-11/h4-7,9-10,14H,8H2,1-3H3
charge 0 multiplicity 1
32 atoms
I  5.743634 0.255121 -0.708206
N  -2.864245 -0.162663 0.448269
C  -1.499463 -0.237405 -0.137036
C  -0.496408 -0.461537 1.035172
C  -3.989538 0.261228 -0.430717
C  -1.334575 -1.30966 -1.246807
C  0.962174 -0.310736 0.636638
C  -3.818391 1.733125 -0.866299
C  -5.304386 0.073771 0.354512
C  1.815236 -1.432711 0.487364
C  1.507274 0.976619 0.390838
C  3.169489 -1.2868 0.104277
C  2.85573 1.146455 0.00642
C  3.678243 0.007206 -0.134057
H  -1.27873 0.755887 -0.573631
H  -0.671104 -1.471019 1.460201
H  -0.761304 0.272495 1.819166
H  -4.055016 -0.363994 -1.356659
H  -3.097086 -1.044497 0.930893
H  -2.048081 -1.140341 -2.073599
H  -1.519587 -2.32255 -0.837448
H  -0.314345 -1.292857 -1.671169
H  -4.696354 2.063188 -1.451249
H  -3.720219 2.378345 0.025501
H  -2.924275 1.878218 -1.499417
H  -5.446574 -0.982668 0.655082
H  -6.1730 0.369115 -0.260708
H  -5.291427 0.693523 1.269559
H  1.423051 -2.439414 0.675488
H  0.874328 1.864477 0.511071
H  3.809718 -2.167434 -0.001638
H  3.255228 2.14861 -0.173309
