program: Gaussian 09
title: 000156374
version: EM64L-G09RevD.01
frameworkgroup: C1[X(C11H13NO2)]
method: RPBEPBE
basis: SDD
operation: Freq
keyword: #p
keyword: freq=noraman
keyword: PBEPBE/SDD
title: #p freq=noraman PBEPBE/SDD
converged: YES YES NO NO
title: Mulliken charges:
elementType: O O N C C C C C C C C C C C H H H H H H H H H H H H H
charge: -0.304392 -0.301710 0.011596 0.428964 -0.565950 0.157513 -0.486143 0.069482 -0.452735 -0.440389 0.196696 -0.350578 -0.528121 -0.528551 0.233363 0.221081 0.232889 0.223321 0.241737 0.267022 0.252105 0.227138 0.231933 0.256718 0.223116 0.230433 0.253465
chargesum: 0.00000
title: Mulliken charges with hydrogens summed into heavy atoms:
elementType: O O N C C C C C C C C C C C
charge: -0.304392 -0.301710 0.011596 0.428964 -0.111505 0.157513 -0.029933 0.069482 -0.210998 -0.173367 0.196696 -0.098474 0.187667 0.178463
polarizability: 1.84168179e+02 8.31748321e-02 1.37597755e+02 -2.75262918e-01 5.34692756e+00 7.70339585e+01
1716.lowfreq: -7.9716 -0.0006 0.0003 0.0004 7.5411 11.8506 62.7091 79.6492 104.6290
frequency: 62.6589 79.6055 104.6214 121.6722 148.4507 159.9754 160.3272 178.2554 232.8018 261.5162 292.9689 343.3007 371.6223 402.1988 450.1302 472.3671 486.6124 525.6813 598.8246 606.1199 638.0438 691.4591 753.5365 779.3188 825.1241 832.6839 838.7855 894.7231 933.8887 939.9643 950.0941 983.1806 1001.1186 1051.2095 1059.8217 1112.7986 1113.9553 1142.5028 1153.2456 1156.7148 1173.5082 1205.2429 1215.4749 1232.5700 1259.6418 1306.7068 1334.7973 1347.5178 1374.1772 1404.5166 1425.1315 1439.0692 1448.5523 1454.1701 1457.9124 1460.3308 1467.5724 1477.2977 1486.5263 1567.5423 1589.8508 1603.2063 2958.0255 2965.8702 2973.5496 2976.3762 3043.0709 3053.2918 3070.8092 3074.8746 3116.6601 3122.3308 3124.3294 3132.0313 3163.3173
redmass: 3.1325 3.8415 2.6403 2.7911 2.2570 1.1050 1.2721 3.2274 3.4836 5.6589 3.4302 4.7155 4.0829 3.5797 5.8889 4.9126 4.9469 3.4785 4.2729 4.7781 3.6472 5.3984 2.6080 3.3312 3.9392 1.9001 2.9650 4.3614 1.6816 4.1875 1.3610 5.8687 2.6630 2.5313 2.4944 1.2362 1.2391 1.4089 1.3834 1.5190 1.1935 2.5561 1.5992 1.8828 2.6080 1.4161 1.5794 1.5948 3.0723 2.6271 1.2765 1.3328 1.1847 1.1092 1.0623 1.0991 2.2439 1.0738 1.0530 6.8569 8.0968 6.9775 1.0696 1.0636 1.0310 1.0306 1.0942 1.0952 1.1034 1.1043 1.0905 1.1028 1.1031 1.0889 1.0956
irintensity: 4.0346 2.3765 7.1018 3.0938 0.1795 0.4647 0.0364 4.8308 8.1225 8.1683 5.8866 0.7531 1.3226 13.3506 1.7974 2.4698 9.4311 0.6347 1.6887 7.6116 9.8506 0.3486 24.0557 8.2806 25.5401 32.9820 3.5481 8.5412 4.7145 45.8161 0.3124 87.3437 10.3872 42.8449 9.6127 10.5626 2.9131 5.1665 1.0195 7.2869 0.8177 45.1319 6.7451 98.5659 69.6448 17.6764 6.6795 27.1638 18.1598 21.6575 0.9457 23.4512 40.9265 3.4853 18.7568 3.4037 41.2319 6.8868 23.7099 49.0809 9.7517 16.7663 28.1431 39.4120 84.0224 54.9811 34.1492 41.4419 27.8251 22.5517 12.1165 24.2580 20.2916 10.3811 8.6846
temp: 298.150 k
press: 1.00000 atm
elementType: 8 8 7 6 6 6 6 6 6 6 6 6 6 6 1 1 1 1 1 1 1 1 1 1 1 1 1
symmnumber: 1
zpe: 570724.8 jmol-1
zpe.correction: 0.217378 hartree
zpe.thermalcorrener: 0.230665 hartree
zpe.thermalcorrenthalpy: 0.231609 hartree
zpe.thermalcorrgfe: 0.177813 hartree
zpe.sumelectzpe: -631.081218 hartree
zpe.sumelectthermal: -631.067931 hartree
zpe.sumelectthermalent: -631.066987 hartree
zpe.sumelectthermalfe: -631.120783 hartree
dipole: -1.7700 -1.8276 -0.3642
dipole: 2.5701
quadrupole: -77.5840 -80.8581 -82.8207
quadrupole: -12.3550 -4.6038 -3.9647
quadrupole: 2.8370 -0.4372 -2.3998 -12.3550 -4.6038 -3.9647
hfenergy: -631.2985959 hartree
pointgroup: C01 [X(C11H13N1O2)]
dipole: 0.7649626 0.6316966 -0.1955164 debye
polarizability: 183.6325683|-4.9762368|137.2334121|-1.9037551|-8.8948617|77.9339123 unknown
InChI: InChI=1S/C11H13NO2/c1-13-10-4-3-8-5-6-12-7-9(8)11(10)14-2/h3-4,7H,5-6H2,1-2H3
charge 0 multiplicity 1
27 atoms
O  1.132877 -1.740063 0.339379
O  2.942283 0.418863 -0.389137
N  -2.994001 -1.191922 0.380696
C  -1.24104 1.132976 -0.041724
C  -2.731258 1.347014 0.179246
C  -0.734327 -0.179827 0.196903
C  -3.534955 0.078222 -0.193053
C  0.657676 -0.435834 0.076307
C  -0.355034 2.162031 -0.419444
C  -1.692356 -1.258414 0.540233
C  1.548339 0.624419 -0.258618
C  1.033144 1.910159 -0.524234
C  1.76174 -2.421016 -0.818874
C  3.633072 0.037948 0.865875
H  -2.903276 1.573938 1.252734
H  -3.097929 2.217098 -0.39552
H  -4.582612 0.171984 0.142213
H  -3.56059 -0.052135 -1.296509
H  -0.741075 3.16863 -0.616442
H  -1.280619 -2.1991 0.927407
H  1.737906 2.700654 -0.801527
H  1.009491 -2.584779 -1.613079
H  2.115488 -3.388246 -0.431228
H  2.604679 -1.825809 -1.21285
H  3.557409 0.858259 1.604709
H  4.685754 -0.116404 0.58422
H  3.204512 -0.888245 1.289117
