program: Gaussian 09
title: 000156368
version: EM64L-G09RevD.01
frameworkgroup: C1[X(C10H12N3O3PS2)]
method: RPBEPBE
basis: SDD
operation: Freq
keyword: #p
keyword: freq=noraman
keyword: PBEPBE/SDD
title: #p freq=noraman PBEPBE/SDD
converged: NO YES NO NO
title: Mulliken charges:
elementType: S S P O O O N N N C C C C C C C C C C H H H H H H H H H H H H
charge: 0.029097 -0.014060 0.771086 -0.469899 -0.256559 -0.570080 -0.196732 -0.002646 -0.083427 0.160237 -0.613723 0.249782 0.052041 -0.313143 -0.293300 -0.219559 -0.197803 -0.833800 -0.507039 0.323786 0.319237 0.276983 0.269412 0.243872 0.244707 0.313476 0.274386 0.272849 0.291909 0.231953 0.246956
chargesum: 0.00000
title: Mulliken charges with hydrogens summed into heavy atoms:
elementType: S S P O O O N N N C C C C C C C C C C
charge: 0.029097 -0.014060 0.771086 -0.469899 -0.256559 -0.570080 -0.196732 -0.002646 -0.083427 0.160237 0.029300 0.249782 0.052041 -0.036160 -0.023888 0.024313 0.046904 0.026911 0.263778
polarizability: 3.59751365e+02 3.15362866e+00 1.87237171e+02 8.25445859e+00 2.46189240e+00 1.33790987e+02
1716.lowfreq: -20.2545 -5.0018 -0.0002 0.0002 0.0013 2.1058 17.6040 28.0607 37.4398
frequency: 13.8379 27.3289 37.4112 48.9117 55.3973 74.1884 99.3306 109.9098 116.8973 125.3993 132.4583 137.7885 146.6058 193.7339 197.2556 220.7420 255.3152 268.2546 283.7311 304.1441 321.0178 333.5225 396.6367 421.7013 434.8770 453.6482 476.2301 482.4062 519.8876 551.5481 605.8027 618.2693 633.2800 638.9002 677.1630 692.1370 764.9752 781.2357 792.8494 804.2811 849.8690 903.4303 941.9519 951.4259 971.8377 985.1104 987.1523 1000.2154 1011.1899 1021.7750 1024.8251 1096.5584 1120.0913 1124.7386 1164.7614 1186.1127 1193.1190 1248.2605 1272.9864 1283.0830 1300.9902 1351.9935 1384.6144 1412.9838 1421.1982 1424.3810 1444.3213 1449.1906 1458.7662 1461.3679 1463.2207 1469.2511 1566.4140 1612.6424 1613.9748 2987.3992 3002.6317 3063.7030 3101.6415 3122.6539 3131.0939 3144.8482 3154.5644 3158.5593 3164.3685 3171.9524 3181.7430
redmass: 5.8534 7.6482 5.0053 4.0015 7.1928 3.8880 5.1544 1.9664 1.2568 2.5302 3.1520 4.3247 5.9392 4.8881 5.9689 6.7845 12.8639 4.0700 9.6503 5.1826 5.6230 6.4167 9.6285 3.5016 20.2977 5.8098 6.0491 8.7314 6.5028 9.8034 5.2029 9.8758 7.7374 6.4744 6.3843 4.8880 7.1321 3.4378 1.5613 2.9765 5.5158 1.4497 11.0031 5.6354 1.1699 1.3773 2.3113 1.2221 1.3492 13.6860 2.1032 2.2404 1.2859 1.2388 1.3394 2.0348 2.3847 2.4430 1.7874 1.6288 1.2858 1.1171 5.6745 4.6351 1.2046 1.1576 2.5189 1.0504 1.0555 1.0548 2.6189 1.0947 6.9115 6.7668 10.5151 1.0300 1.0309 1.0573 1.1041 1.1004 1.1044 1.0868 1.1069 1.0905 1.1105 1.0959 1.0999
irintensity: 0.2958 0.6762 1.4422 0.7892 1.9696 0.9765 3.7827 1.3500 0.2087 2.0197 6.4521 4.3985 8.3714 7.8286 8.4336 1.4190 8.8487 1.8910 3.1044 5.2837 1.5518 8.5642 27.8987 2.5339 284.9314 2.2990 5.5286 17.4020 5.8305 13.5038 8.1593 72.0651 11.0856 16.9834 4.8661 47.2476 49.0423 26.3633 49.7179 151.4166 18.3316 0.2234 71.5729 14.9535 5.1858 2.5197 55.2881 23.0774 0.0258 96.5876 10.3784 5.5428 0.2370 0.4128 0.8628 25.3412 0.7588 72.0336 42.7831 11.2553 16.0890 4.4552 62.2835 5.0618 25.9860 20.4581 23.5838 19.6032 3.8331 14.7191 4.8559 26.8240 13.3330 1.3101 234.5348 37.7655 30.7312 4.2192 2.8490 1.8011 5.8270 3.0692 9.0377 5.7023 3.1129 5.2902 16.5776
temp: 298.150 k
press: 1.00000 atm
elementType: 16 16 15 8 8 8 7 7 7 6 6 6 6 6 6 6 6 6 6 1 1 1 1 1 1 1 1 1 1 1 1
symmnumber: 1
zpe: 567077.6 jmol-1
zpe.correction: 0.215988 hartree
zpe.thermalcorrener: 0.236890 hartree
zpe.thermalcorrenthalpy: 0.237834 hartree
zpe.thermalcorrgfe: 0.162950 hartree
zpe.sumelectzpe: -1914.085319 hartree
zpe.sumelectthermal: -1914.064417 hartree
zpe.sumelectthermalent: -1914.063473 hartree
zpe.sumelectthermalfe: -1914.138358 hartree
dipole: 4.4657 3.9508 1.3920
dipole: 6.1228
quadrupole: -98.2600 -137.0504 -139.6667
quadrupole: 2.2775 -4.4237 -0.5952
quadrupole: 26.7324 -12.0581 -14.6743 2.2775 -4.4237 -0.5952
hfenergy: -1914.3013075 hartree
pointgroup: C01 [X(C10H12N3O3P1S2)]
dipole: -1.7818506 -1.4107819 0.7984179 debye
polarizability: 359.9940584|0.3310601|184.4678906|-5.1198773|-11.9971751|136.3175737 unknown
InChI: InChI=1S/C8H6N3OS.CH3O2P.CH3S/c12-8-6-3-1-2-4-7(6)9-10-11(8)5-13;1-3-4-2;1-2/h1-4H,5H2;1H3;1H3
charge 0 multiplicity 1
31 atoms
S  2.023723 1.096638 0.514962
S  5.028983 -0.377781 1.651006
P  3.963043 0.154597 -0.332325
O  3.442622 -1.304294 -1.118983
O  -0.268297 -1.532336 -0.379677
O  4.843985 1.031992 -1.326763
N  -0.464419 0.786551 -0.685806
N  -1.187429 2.038897 -0.667569
N  -2.44203 2.027384 -0.320532
C  -2.413598 -0.446002 0.029799
C  0.929026 0.945026 -1.067585
C  -0.989315 -0.493962 -0.343427
C  -3.090197 0.812751 0.034494
C  -3.116124 -1.623677 0.385623
C  -4.460746 0.887719 0.397173
C  -4.47456 -1.542913 0.741887
C  -5.145953 -0.287306 0.748649
C  6.75809 0.192709 1.1206
C  2.883871 -2.421961 -0.314016
H  1.277038 0.059553 -1.619787
H  1.029866 1.875218 -1.639422
H  -2.579322 -2.577249 0.374599
H  -4.947821 1.867177 0.391441
H  -5.020952 -2.451078 1.016654
H  -6.203047 -0.238688 1.029357
H  6.662854 0.840703 0.232274
H  7.374717 -0.686513 0.889081
H  7.174838 0.764267 1.962588
H  1.885888 -2.155974 0.070733
H  3.579578 -2.690543 0.501793
H  2.800387 -3.250604 -1.033019
