program: Gaussian 09
title: 000156362
version: EM64L-G09RevD.01
frameworkgroup: C1[X(C11H13N3O)]
method: RPBEPBE
basis: SDD
operation: Freq
keyword: #p
keyword: freq=noraman
keyword: PBEPBE/SDD
title: #p freq=noraman PBEPBE/SDD
converged: YES YES NO NO
title: Mulliken charges:
elementType: O N N N C C C C C C C C C C C H H H H H H H H H H H H H
charge: -0.245794 -0.201105 -0.241312 -0.415001 -0.157711 -0.477658 -0.365683 -0.462854 0.330369 0.093793 0.296226 -0.351426 -0.390753 -0.260286 -0.239212 0.231299 0.228226 0.264988 0.221175 0.202021 0.224035 0.223599 0.254109 0.325556 0.233898 0.226400 0.224225 0.228875
chargesum: 0.00000
title: Mulliken charges with hydrogens summed into heavy atoms:
elementType: O N N N C C C C C C C C C C C
charge: -0.245794 -0.201105 0.012797 -0.089444 0.073588 0.015557 0.057514 -0.015221 0.330369 0.093793 0.296226 -0.117528 -0.164352 -0.036061 -0.010336
polarizability: 1.97003865e+02 1.14896613e+01 1.52683296e+02 3.50424036e+00 -2.98169225e+00 7.68981195e+01
1716.lowfreq: -6.3907 -2.4429 -0.0008 -0.0006 -0.0003 16.1436 49.7175 88.8139 111.6857
frequency: 49.6682 88.8088 111.6851 176.8737 231.2215 240.0232 288.6381 311.6447 330.6108 366.5796 417.9218 421.5011 446.8178 462.3595 524.6165 539.8047 558.9601 596.8454 613.6965 642.5584 660.7724 708.1224 726.9544 740.7475 745.5313 830.2834 837.0045 847.5148 905.6996 912.8206 935.3933 944.1315 960.4891 994.2605 1021.9670 1044.5251 1059.1025 1112.0150 1122.2604 1146.6903 1160.7460 1176.0257 1199.1578 1231.8040 1251.5590 1254.2319 1279.8279 1286.2107 1317.3392 1338.6585 1342.1605 1356.6785 1359.9551 1365.7198 1384.2548 1412.7796 1440.6884 1444.9767 1448.9216 1465.4110 1473.0870 1508.7556 1593.6037 1621.3513 1628.7258 2839.0238 2884.7212 2992.3401 3012.5047 3041.5703 3063.4654 3104.2141 3121.6801 3137.6494 3161.9815 3174.8190 3443.6114 3516.9914
redmass: 3.9411 3.8659 4.6922 3.0858 4.1583 3.0358 4.9160 4.4524 2.0643 5.9684 2.7571 4.6827 5.2390 3.4609 3.2332 3.4917 3.9561 1.7687 3.8150 3.4225 2.9649 1.7393 3.7555 2.5363 1.3760 1.8839 1.5356 4.2967 2.7028 1.4458 2.9400 2.8723 1.3065 2.5875 2.2231 2.2859 2.5733 2.1423 2.0679 2.9910 2.3053 1.0778 1.4792 2.2321 1.3167 1.5604 1.7050 1.3902 1.3534 1.4224 2.2906 1.2712 2.1511 1.4779 2.6848 2.8155 1.0753 1.1928 1.1029 1.1220 2.8927 3.1104 7.4251 6.6621 5.8805 1.0795 1.0698 1.0620 1.0655 1.0892 1.1032 1.0999 1.0886 1.0879 1.0935 1.0982 1.0748 1.0763
irintensity: 1.1110 1.6778 0.3469 0.8207 0.7742 12.9788 2.0329 3.5074 20.9547 0.9357 9.5398 0.1843 3.7805 7.9778 2.2912 8.5782 0.1794 49.3107 37.6881 46.2235 144.8948 36.0791 3.1131 11.7985 166.5071 5.3654 2.7893 0.3940 3.2102 5.9237 12.0732 18.6620 0.0425 4.2623 9.5578 16.9292 0.8261 5.2044 2.5790 47.3263 2.4893 1.0613 6.5993 28.3557 3.1303 65.0448 0.6825 18.7104 5.0950 19.6957 158.6458 13.0021 35.4871 31.7231 9.4040 21.7747 5.1401 14.0194 16.9171 27.4524 2.1079 148.4020 33.6531 49.8981 450.6324 77.9734 82.7748 41.4595 22.3711 33.8505 37.9036 14.3861 10.7903 9.1023 27.0739 14.9535 0.8034 21.8875
temp: 298.150 k
press: 1.00000 atm
elementType: 8 7 7 7 6 6 6 6 6 6 6 6 6 6 6 1 1 1 1 1 1 1 1 1 1 1 1 1
symmnumber: 1
zpe: 601209.2 jmol-1
zpe.correction: 0.228988 hartree
zpe.thermalcorrener: 0.240857 hartree
zpe.thermalcorrenthalpy: 0.241801 hartree
zpe.thermalcorrgfe: 0.191127 hartree
zpe.sumelectzpe: -665.360113 hartree
zpe.sumelectthermal: -665.348245 hartree
zpe.sumelectthermalent: -665.347301 hartree
zpe.sumelectthermalfe: -665.397975 hartree
dipole: -1.8296 -2.9635 1.1385
dipole: 3.6641
quadrupole: -90.0915 -87.8231 -89.3619
quadrupole: -10.5725 4.6316 -1.9149
quadrupole: -0.9993 1.2690 -0.2697 -10.5725 4.6316 -1.9149
hfenergy: -665.589102 hartree
pointgroup: C01 [X(C11H13N3O1)]
dipole: 0.7458898 1.160446 0.4185069 debye
polarizability: 197.3240186|10.6088558|152.3583807|-4.934621|1.5335154|76.9028815 unknown
InChI: InChI=1S/C11H13N3O/c15-11-10-7-12-5-6-14(10)9-4-2-1-3-8(9)13-11/h1-4,10,12-13H,5-7H2
charge 0 multiplicity 1
28 atoms
O  -1.477687 -2.920536 0.096922
N  -0.544471 0.626344 -0.080092
N  -3.446352 0.893236 0.177409
N  0.589847 -1.899864 -0.157358
C  -1.352554 -0.497027 0.476455
C  -2.82617 -0.425141 -0.031871
C  -1.159044 1.968812 0.03805
C  -2.633556 1.961779 -0.434745
C  0.864607 0.524857 -0.009241
C  -0.766761 -1.872586 0.114493
C  1.455058 -0.776874 -0.075268
C  1.739636 1.641541 0.071975
C  2.853596 -0.945284 -0.08814
C  3.142356 1.469391 0.050421
C  3.708209 0.178845 -0.033893
H  -1.376582 -0.436311 1.595636
H  -2.831829 -0.64627 -1.115544
H  -3.409799 -1.212221 0.470051
H  -0.59024 2.673366 -0.594591
H  -1.101583 2.33547 1.091957
H  -3.089262 2.944941 -0.219193
H  -2.654068 1.813535 -1.531609
H  -3.674526 1.076992 1.163886
H  0.989958 -2.821819 -0.35544
H  1.33593 2.653816 0.155107
H  3.273117 -1.957611 -0.14254
H  3.790326 2.350612 0.108677
H  4.794145 0.04431 -0.048315
