program: Gaussian 09
title: 000156358
version: EM64L-G09RevD.01
frameworkgroup: C1[X(C10H10N2O3)]
method: RPBEPBE
basis: SDD
operation: Freq
keyword: #p
keyword: freq=noraman
keyword: PBEPBE/SDD
title: #p freq=noraman PBEPBE/SDD
converged: YES YES NO NO
title: Mulliken charges:
elementType: O O O N N C C C C C C C C C C H H H H H H H H H H
charge: -0.250666 -0.408763 -0.237133 -0.229650 -0.448157 0.288022 -0.401222 0.251503 0.130990 -0.483073 -0.345783 -0.334530 -0.227046 -0.216974 0.196457 0.251555 0.269235 0.267154 0.285757 0.330460 0.242003 0.235439 0.226635 0.227657 0.380127
chargesum: 0.00000
title: Mulliken charges with hydrogens summed into heavy atoms:
elementType: O O O N N C C C C C C C C C C
charge: -0.250666 -0.028636 -0.237133 -0.229650 -0.117697 0.288022 0.119569 0.251503 0.130990 0.069839 -0.103780 -0.099092 -0.000411 0.010683 0.196457
polarizability: 1.63018799e+02 1.69987469e+01 1.45043709e+02 -1.16052561e+01 5.26174542e+00 7.65627471e+01
1716.lowfreq: -6.2025 -0.0002 0.0005 0.0009 0.9754 6.8285 23.2601 26.0002 54.7677
frequency: 23.0814 25.9297 54.7571 74.2323 130.7692 165.2192 193.2764 243.6624 288.0069 320.0442 358.6107 427.9122 447.8402 493.0230 511.4737 546.6452 553.9824 574.1507 590.1347 607.2749 646.7085 676.9457 705.2176 742.3163 743.0915 745.8466 784.4943 844.4817 865.8729 885.4394 916.1398 918.4150 965.7432 1014.8982 1026.7104 1063.4715 1084.5894 1101.9034 1147.3273 1161.3926 1171.8994 1223.0556 1243.6912 1247.8223 1286.1955 1320.5966 1336.6214 1348.0398 1362.9948 1390.4447 1427.8304 1443.2629 1464.5455 1470.9289 1493.2344 1615.0513 1634.3623 1661.6817 1682.9941 3002.6112 3030.8326 3068.9949 3098.1818 3135.9504 3145.8128 3157.4509 3172.2719 3510.2791 3623.4845
redmass: 9.8506 6.4302 4.8479 2.3317 7.5568 6.1708 5.8765 2.6661 5.5688 5.9411 6.3287 3.2951 3.8929 7.8660 1.9819 4.3604 1.1339 3.7509 4.5820 5.3354 1.3655 6.4631 7.5522 3.8654 2.8205 1.4888 1.7469 1.4078 4.6709 4.0032 1.4875 2.8885 1.2985 2.1145 3.6305 2.4789 2.5280 1.8832 3.5849 1.9234 1.0990 1.4445 1.5302 1.4822 1.5583 1.8132 1.9843 1.5975 4.6912 1.6075 2.9314 1.0929 1.1433 2.6823 4.5771 7.0335 7.8180 8.2789 8.9983 1.0644 1.0603 1.0968 1.1043 1.0852 1.0899 1.0954 1.1004 1.0639 1.0809
irintensity: 1.3732 0.4421 0.5215 0.4272 0.9137 2.3897 0.0202 0.9002 4.5352 4.0480 2.8144 16.0660 15.4494 3.4853 37.7038 57.9065 122.3053 1.3367 0.5555 3.6752 121.4198 14.5561 2.0297 4.7928 20.7130 106.0770 21.8172 0.0809 0.8995 2.9563 3.3149 5.6326 0.0271 22.7481 128.3665 12.0215 135.6919 20.0482 31.6052 50.2878 0.6801 6.7619 8.0466 0.3652 20.4207 76.2307 28.3120 22.3359 140.0189 17.4765 7.4096 16.4212 27.2147 5.2222 137.0865 21.0093 19.4362 219.3220 644.7704 5.0940 12.8228 0.5917 4.4106 0.2052 9.9809 24.3482 14.6542 23.1018 72.2622
temp: 298.150 k
press: 1.00000 atm
elementType: 8 8 8 7 7 6 6 6 6 6 6 6 6 6 6 1 1 1 1 1 1 1 1 1 1
symmnumber: 1
zpe: 499094.9 jmol-1
zpe.correction: 0.190095 hartree
zpe.thermalcorrener: 0.203146 hartree
zpe.thermalcorrenthalpy: 0.204091 hartree
zpe.thermalcorrgfe: 0.148035 hartree
zpe.sumelectzpe: -721.204184 hartree
zpe.sumelectthermal: -721.191133 hartree
zpe.sumelectthermalent: -721.190189 hartree
zpe.sumelectthermalfe: -721.246244 hartree
dipole: -1.8473 -2.2573 1.5954
dipole: 3.3246
quadrupole: -70.4526 -91.2872 -92.9105
quadrupole: -6.7229 2.3677 0.4854
quadrupole: 14.4308 -6.4037 -8.0271 -6.7229 2.3677 0.4854
hfenergy: -721.3942794 hartree
pointgroup: C01 [X(C10H10N2O3)]
dipole: 0.7563777 0.8750075 0.6108609 debye
dipolederiv: -0.8267598 -0.5571054 -0.0336187 -0.4738026 -1.3403369 -0.0216901 -0.0327839 -0.0087295 -0.3745615 -0.8544227 0.0026387 0.5374847 0.039187 -0.3915031 -0.1134667 0.5347728 -0.0851525 -0.8389146 -0.6975137 0.1376538 -0.1702636 0.1172985 -0.3620455 0.1789738 0.0739518 0.0754937 -0.9254679 -0.9140872 -0.0342505 -0.0411412 -0.2570501 -1.0756869 0.0093184 -0.1069982 0.0901862 -0.2139448 -0.9364372 -0.4020516 -0.0516381 -0.2265502 -0.7478126 -0.0005076 -0.1127183 -0.0443389 -0.3500309 0.6883276 0.6380334 0.018651 0.450413 0.0823746 0.0523686 0.0980623 0.1457045 0.0498559 0.7623303 -0.1338483 -0.0026706 -0.1616261 0.1322414 0.0064478 -0.0023148 0.0089971 0.2325554 -0.213395 0.0007629 -0.0440949 0.4137996 0.8160391 -0.0165427 -0.1158677 -0.095847 0.0439956 1.3745042 0.5588664 0.1730072 0.3699627 1.9000393 -0.0486907 0.2026991 -0.0828281 0.2781839 -0.4031093 0.1350885 -0.0660866 0.1656199 0.0775939 0.0354929 -0.1620402 0.0389788 -0.1060543 -0.005541 0.0455811 0.0366529 -0.1129061 0.0419324 -0.037794 0.073034 -0.0273836 -0.16654 0.088318 -0.0526562 0.072259 0.0571585 0.0292957 -0.0179551 0.0560422 -0.0416995 -0.1627617 -0.0891808 -0.1605131 0.0412928 0.0458405 0.0428125 -0.0233091 0.0177384 -0.0667126 -0.1644451 0.0216517 0.1004169 0.0423513 -0.1150041 -0.1359428 -0.0284077 0.0636486 0.0201125 -0.164661 1.4375295 -0.3011406 -0.2216871 -0.3146024 0.3094736 -0.1621195 -0.3115972 -0.1152546 1.454079 0.0566242 -0.0097738 0.0286902 0.043924 0.0035133 0.1053699 0.0414546 0.0583659 0.0133658 0.0214137 -0.0085131 -0.0116009 -0.0853061 0.0234784 -0.0823832 0.0262344 -0.0341113 0.0685634 0.0712216 -0.0422798 -0.043101 -0.0263186 0.000917 -0.0761718 -0.0252252 -0.0489099 0.0624127 0.0902804 0.0088296 0.0252676 -0.0122063 0.0222604 0.0777284 0.043402 0.0400044 0.0426035 0.1716492 -0.0521246 -0.0380114 -0.0512832 0.2203318 0.0101107 -0.040198 0.0079365 0.3504374 -0.0299839 0.0827193 -0.0577697 0.0740938 0.0640843 0.0232893 -0.0661988 0.0316829 0.1461435 -0.0159272 0.0709096 -0.0537219 0.0949206 0.0211815 0.0431761 -0.0598851 0.0373669 0.1564861 0.0831951 -0.0227188 -0.0160556 -0.0362813 -0.1161618 0.0319244 -0.0152458 0.0317056 0.1569413 -0.0772253 -0.088823 -0.045228 -0.0902368 0.0432978 -0.0048506 -0.0475541 -0.0056144 0.1563558 0.1965377 0.0842987 -0.0789672 0.0909556 0.3386226 0.0596884 -0.1324129 0.0700468 0.2554025 unknown
polarizability: 164.1382706|16.5581438|143.8899063|10.6750016|-6.643276|76.5970779 unknown
InChI: InChI=1S/C10H10N2O3/c13-9(14)5-6-12-8-4-2-1-3-7(8)11-10(12)15/h1-4,11,13H,5-6H2
charge 0 multiplicity 1
25 atoms
O  -0.327388 -2.982669 -0.102756
O  -4.424976 0.764794 1.245229
O  -3.936945 1.042389 -1.008105
N  -0.01456 -0.616393 -0.361216
N  1.764292 -1.8446 0.24345
C  1.068784 0.271707 -0.208107
C  -1.39247 -0.276804 -0.715583
C  2.204687 -0.510088 0.172598
C  0.390459 -1.948046 -0.075144
C  -2.215934 0.141341 0.524891
C  1.166426 1.66438 -0.373454
C  3.457115 0.083987 0.397326
C  2.43104 2.264339 -0.147113
C  3.555225 1.489219 0.231924
C  -3.575603 0.684038 0.135183
H  -1.395076 0.529566 -1.468854
H  -1.84476 -1.170213 -1.178633
H  -1.687096 0.930356 1.095059
H  -2.347598 -0.709092 1.21601
H  2.31955 -2.661568 0.485839
H  0.303881 2.269322 -0.67084
H  4.329343 -0.510392 0.687968
H  2.538633 3.347258 -0.268742
H  4.51866 1.981734 0.399839
H  -5.30329 1.140233 0.962432
