program: Gaussian 09
title: 000156355
version: EM64L-G09RevD.01
frameworkgroup: C1[X(C9H10N4O3S2)]
method: RPBEPBE
basis: SDD
operation: Freq
keyword: #p
keyword: freq=noraman
keyword: PBEPBE/SDD
title: #p freq=noraman PBEPBE/SDD
converged: YES YES NO NO
title: Mulliken charges:
elementType: S S O O O N N N N C C C C C C C C C H H H H H H H H H H
charge: 0.327673 0.342730 -0.424005 -0.243474 -0.230914 -0.241287 0.125228 0.046787 -0.661709 -0.066074 -0.682826 -0.190526 -0.454997 0.245426 0.237594 -0.431514 0.168760 -0.768340 0.262599 0.318930 0.288536 0.258685 0.305795 0.352787 0.249424 0.227475 0.249183 0.388054
chargesum: 0.00000
title: Mulliken charges with hydrogens summed into heavy atoms:
elementType: S S O O O N N N N C C C C C C C C C
charge: 0.327673 0.342730 -0.035951 -0.243474 -0.230914 -0.241287 0.125228 0.046787 -0.003127 0.196524 -0.075360 -0.190526 -0.454997 0.245426 0.237594 -0.172828 0.168760 -0.042258
polarizability: 2.56886317e+02 -1.47218969e+01 1.86795681e+02 1.44065879e+01 8.99116826e+00 8.85583924e+01
1716.lowfreq: -2.4350 -0.0024 -0.0022 -0.0021 5.3902 6.6153 26.3970 38.6531 46.6051
frequency: 26.3797 38.6493 46.6006 64.6836 77.7882 95.5432 116.5317 134.2042 159.3779 184.0950 197.3387 245.3916 265.0760 291.1530 305.2333 340.0263 350.4809 355.4785 368.1495 398.6039 408.0157 472.1818 502.0379 524.1393 526.4353 545.6356 565.6510 576.7125 597.8769 622.6198 639.9708 653.2280 705.7029 714.4236 758.5766 780.2302 814.3871 826.2482 846.9946 896.4999 929.0243 985.3861 995.6665 1018.6441 1047.9662 1053.1597 1113.2334 1116.7053 1171.5279 1185.2701 1196.6022 1209.0677 1218.8149 1248.8673 1274.5581 1301.9147 1350.2513 1371.5260 1402.8821 1405.5015 1452.4936 1455.7249 1460.2090 1517.3139 1545.9069 1635.0675 1651.0735 1663.9453 2851.2310 2993.6365 3051.3006 3075.4182 3115.3127 3146.5275 3188.7193 3438.3100 3517.2545 3586.0820
redmass: 7.6268 11.2442 7.0491 5.8837 6.4820 5.5842 1.0811 12.8239 7.5590 5.1464 4.8836 4.8213 3.3404 4.3532 10.8436 3.6003 2.2052 3.1145 4.1790 8.3217 2.8869 4.2555 8.5709 4.2999 7.9932 7.0590 5.2097 7.4337 2.0149 6.4155 4.9871 2.6901 3.6164 4.6198 1.6005 8.6133 2.2492 9.0389 1.4538 2.1783 5.8317 5.9437 4.2891 1.6433 1.5676 2.2670 3.0180 2.9228 9.6900 1.1394 6.6693 1.4664 1.6600 1.1991 1.6067 1.3929 3.3060 1.9328 1.3089 1.1199 1.0454 8.5164 1.1451 10.7348 5.1895 1.2739 4.3261 9.2476 1.0787 1.0373 1.0587 1.0969 1.1002 1.1072 1.0927 1.0495 1.0641 1.0951
irintensity: 0.4992 3.1253 1.0668 1.3267 0.4947 1.1761 0.0670 0.0877 2.4744 0.7961 4.9724 2.1101 3.9928 4.0073 0.1946 4.2299 31.8175 17.9510 8.8503 8.4263 42.0949 23.9136 6.3943 19.3020 6.1811 11.6105 1.2710 2.9780 95.4355 0.1071 21.6808 35.5929 122.1190 0.0759 161.2932 8.8807 57.4931 50.9508 31.9115 5.3581 17.2433 80.1053 37.4022 22.2235 10.6086 287.7432 5.7020 22.3750 24.2977 5.7569 2.9338 1.7517 9.6309 15.1584 29.0268 24.5731 77.3154 12.9775 54.6470 19.3879 15.7911 170.4085 28.3790 488.9258 30.7910 130.8030 376.0994 187.9257 46.4562 8.5668 6.1227 9.2079 18.3766 0.0828 1.2050 47.3484 29.8276 51.8341
temp: 298.150 k
press: 1.00000 atm
elementType: 16 16 8 8 8 7 7 7 7 6 6 6 6 6 6 6 6 6 1 1 1 1 1 1 1 1 1 1
symmnumber: 1
zpe: 508296.0 jmol-1
zpe.correction: 0.193600 hartree
zpe.thermalcorrener: 0.211465 hartree
zpe.thermalcorrenthalpy: 0.212409 hartree
zpe.thermalcorrgfe: 0.146106 hartree
zpe.sumelectzpe: -1588.404049 hartree
zpe.sumelectthermal: -1588.386184 hartree
zpe.sumelectthermalent: -1588.385240 hartree
zpe.sumelectthermalfe: -1588.451543 hartree
dipole: 1.7732 0.1077 1.4848
dipole: 2.3153
quadrupole: -103.9945 -124.9078 -119.3823
quadrupole: 2.2993 -3.9642 -6.7868
quadrupole: 12.1004 -8.8130 -3.2874 2.2993 -3.9642 -6.7868
hfenergy: -1588.5976491 hartree
pointgroup: C01 [X(C9H10N4O3S2)]
dipole: -0.7023634 0.4121242 -0.4081238 debye
polarizability: 257.0963301|2.480449|153.2378502|19.47877|47.5573842|121.9062106 unknown
InChI: InChI=1S/C9H10N4O3S2/c1-4-2-6(14)13-8(11-4)18-9(12-13)17-3-5(10)7(15)16/h2,5,15H,3,10H2,1H3
charge 0 multiplicity 1
28 atoms
S  1.947969 1.642209 1.869904
S  -1.148152 2.203318 1.570953
O  4.70866 -0.449914 -1.864736
O  -0.849155 -2.108286 -0.90829
O  5.335996 0.716454 0.03892
N  -1.224521 -0.084566 0.256496
N  0.125497 0.034691 0.602896
N  -3.389218 0.961093 0.404428
N  2.598395 -1.533523 -0.491401
C  3.018877 -0.170142 -0.155302
C  2.885271 0.053432 1.379964
C  -2.100113 0.929456 0.654299
C  0.333738 1.152832 1.276339
C  -1.673691 -1.232141 -0.533492
C  -3.91024 -0.119582 -0.327208
C  -3.104934 -1.165463 -0.778322
C  4.465036 0.083943 -0.594829
C  -5.392939 -0.054388 -0.586402
H  2.42962 0.622898 -0.682794
H  2.338622 -0.791769 1.820152
H  3.865582 0.182923 1.866815
H  -3.529754 -1.991123 -1.353266
H  2.999993 -1.891815 -1.361809
H  1.580709 -1.667256 -0.424377
H  -5.943239 -0.010441 0.370851
H  -5.74561 -0.923444 -1.163731
H  -5.641174 0.87019 -1.13824
H  5.644977 -0.249387 -2.136818
