program: Gaussian 09
title: 000156341
version: EM64L-G09RevD.01
frameworkgroup: C1[X(C23H20O6)]
method: RPBEPBE
basis: SDD
operation: Freq
keyword: #pfreq=noraman
keyword: PBEPBE/SDD
title: #p freq=noraman PBEPBE/SDD
converged: YES YES NO NO
title: Mulliken charges:
elementType: O O O O O O C C C C C C C C C C C C C C C C C C C C C C C H H H H H H H H H H H H H H H H H H H H
charge: -0.218829 -0.227619 -0.264794 -0.307896 -0.251514 -0.248167 -0.353423 -0.122673 0.311662 -0.121453 0.165850 0.195163 -0.699227 -0.731184 0.041824 -0.381031 0.242253 -0.392656 0.322597 0.091316 0.275086 -0.428580 -0.766697 0.302715 -0.377033 -0.349077 -0.240233 -0.231735 -0.241957 0.290088 0.290513 0.255438 0.251065 0.233430 0.219307 0.235348 0.231647 0.217694 0.262320 0.287256 0.249897 0.248492 0.271252 0.247800 0.231315 0.274974 0.233118 0.241010 0.235346
chargesum: 0.00000
title: Mulliken charges with hydrogens summed into heavy atoms:
elementType: O O O O O O C C C C C C C C C C C C C C C C C C C C C C C
charge: -0.218829 -0.227619 -0.264794 -0.307896 -0.251514 -0.248167 -0.063335 0.167840 0.311662 0.133985 0.165850 0.195163 0.004575 -0.046495 0.041824 -0.118711 0.242253 -0.105400 0.322597 0.091316 0.275086 -0.178683 0.000847 0.302715 -0.145719 -0.074102 -0.007115 0.009274 -0.006611
polarizability: 3.54196736e+02 -2.98602823e+01 3.08548721e+02 1.65988753e+01 3.72679853e+01 1.66801843e+02
1716.lowfreq: -0.0008 -0.0006 0.0001 1.6716 5.5228 8.7423 14.0215 20.5666 35.7144
frequency: 13.2931 19.4013 35.6897 37.9236 50.7493 61.4897 77.8521 93.3795 98.8962 114.4696 135.3643 147.5730 156.4793 170.7501 182.0798 198.0985 210.0948 243.7596 249.2651 263.8761 285.1833 294.2881 301.0082 326.3901 339.4478 358.8766 377.5429 399.4663 428.7581 449.1356 463.5025 484.8861 505.3787 507.1806 536.2522 547.2524 561.6146 592.5712 597.6884 604.2652 615.2817 624.1284 634.2887 639.6950 647.2953 691.5643 699.0741 711.6606 737.0295 750.1900 767.6512 781.5684 784.2506 797.6028 825.6017 840.1910 849.6304 855.9136 875.0255 880.4023 887.6119 931.4038 937.1956 940.0027 954.6842 970.8652 984.8957 985.3007 989.4277 993.6397 1004.1898 1005.6822 1008.7930 1022.6933 1034.9347 1038.2329 1043.0293 1063.9455 1090.8138 1123.4619 1145.6850 1171.4717 1173.5476 1176.8506 1188.3650 1193.3936 1200.3775 1229.9705 1245.3595 1252.2523 1252.7329 1275.6547 1281.6421 1284.1308 1315.5683 1318.9788 1335.7639 1337.8688 1352.7405 1381.9167 1385.0237 1386.0755 1394.6979 1397.8781 1438.0255 1445.0363 1450.6832 1452.3472 1454.3505 1458.6951 1470.8113 1473.7815 1482.0249 1482.3938 1549.5912 1580.1732 1587.1722 1611.0162 1613.3567 1632.5121 1652.3772 2993.5686 3006.4598 3009.5515 3039.4430 3055.5164 3092.6461 3100.7139 3101.7857 3103.9380 3105.2176 3118.7210 3132.9441 3142.4789 3144.1527 3155.8933 3156.4217 3168.5636 3184.0969 3187.1732 3193.1854
redmass: 1.8364 2.1208 2.9583 4.0328 6.6982 6.0342 6.2528 4.1636 3.9206 5.5190 4.5756 1.3824 4.6600 2.2949 3.8489 2.5995 2.1770 2.3081 5.4461 6.3704 5.2417 5.8844 5.9501 5.3145 3.6501 4.2611 3.6620 2.8012 5.3540 3.7078 3.7639 8.9698 4.7818 4.3451 5.5042 6.3127 3.5147 7.2951 6.0656 5.4833 6.3677 5.6194 5.4263 5.3286 4.6000 1.8998 4.7508 3.6081 6.6219 4.9900 5.7091 2.1909 3.5384 4.1894 5.5821 1.4040 1.4342 4.5468 1.6228 3.9530 5.0213 2.0737 1.4318 1.7526 4.6646 2.5927 1.4079 1.3321 5.6208 1.7091 1.5303 1.6521 2.4276 3.5904 2.4585 4.8474 1.7026 3.8719 1.6085 1.7342 2.0298 1.8313 2.1483 1.1041 2.7882 2.5984 1.2189 1.9540 1.8557 2.4456 2.2872 1.8326 2.0401 1.7532 2.0289 1.3100 1.7722 1.5941 1.4420 1.2544 1.4571 4.0158 4.9939 1.3279 2.4223 3.6697 1.0696 1.0599 1.0621 1.0960 3.0744 1.1574 1.0799 2.2424 10.2663 6.4471 7.3650 7.1339 6.6670 8.9729 9.8392 1.0357 1.0361 1.0380 1.0845 1.0867 1.0996 1.1007 1.0940 1.0974 1.0925 1.0995 1.0854 1.1025 1.0890 1.0896 1.0943 1.0994 1.0963 1.0910 1.0948
irintensity: 0.3631 0.6051 0.1824 0.2092 2.3671 0.2154 1.5991 1.1232 2.2900 2.5398 0.2849 2.8583 2.4730 4.5478 2.0723 0.5103 0.0822 1.3577 0.9253 3.4061 5.6636 1.0929 0.2040 0.2603 5.6982 3.7597 3.0265 0.1304 4.6922 1.0693 9.8378 3.2721 2.4052 7.5872 14.1184 4.3961 2.0363 17.0098 0.6286 7.9251 0.1726 4.5558 4.2871 22.6542 13.5109 43.1118 6.3137 4.0680 17.4269 3.6323 10.0740 54.8549 46.6553 79.2628 6.8370 60.0295 6.6096 30.0484 14.0989 110.0007 0.3225 20.7602 6.0263 1.3300 3.1172 11.2016 0.5975 0.6862 3.0808 9.3113 8.2184 11.0579 43.5132 85.5719 10.3993 174.0555 39.2605 79.8119 15.4752 27.2338 14.2712 1.3328 20.5935 3.6287 90.8867 105.0550 71.0070 91.8678 1.5555 15.2330 9.1903 15.0248 16.5868 14.9806 178.6185 0.3644 106.5837 80.9532 58.4758 23.4258 26.4923 40.5254 77.3792 27.7851 44.5162 8.1652 12.3085 11.9077 10.4731 4.1292 6.9446 3.9641 18.1321 13.6872 173.9213 53.3290 4.8663 192.5827 48.3478 213.0653 157.7463 15.0035 14.5566 1.2428 6.6233 5.2766 10.0633 14.5762 6.9146 36.8050 17.3717 21.1954 0.6193 5.1570 6.0198 0.6837 20.9923 27.3372 4.7735 4.2989 2.4489
temp: 298.150 k
press: 1.00000 atm
elementType: 8 8 8 8 8 8 6 6 6 6 6 6 6 6 6 6 6 6 6 6 6 6 6 6 6 6 6 6 6 1 1 1 1 1 1 1 1 1 1 1 1 1 1 1 1 1 1 1 1
symmnumber: 1
zpe: 988383.3 jmol-1
zpe.correction: 0.376455 hartree
zpe.thermalcorrener: 0.401822 hartree
zpe.thermalcorrenthalpy: 0.402766 hartree
zpe.thermalcorrgfe: 0.319241 hartree
zpe.sumelectzpe: -1337.743713 hartree
zpe.sumelectthermal: -1337.718346 hartree
zpe.sumelectthermalent: -1337.717402 hartree
zpe.sumelectthermalfe: -1337.800927 hartree
dipole: 0.9747 -4.7033 0.1571
dipole: 4.8058
quadrupole: -157.6579 -185.3211 -163.1454
quadrupole: -8.7472 -2.8190 -6.5695
quadrupole: 11.0503 -16.6130 5.5627 -8.7472 -2.8190 -6.5695
hfenergy: -1338.1201683 hartree
pointgroup: C01 [X(C23H20O6)]
dipole: 0.4789388 -1.8256863 -0.1114384 debye
polarizability: 357.5761897|-27.6468821|297.5473286|9.0096742|50.4121568|174.4237817 unknown
InChI: InChI=1S/C23H20O6/c1-12(24)26-21-19-18-16(28-22(19)29-23(21,2)3)10-9-14-15(25)11-17(27-20(14)18)13-7-5-4-6-8-13/h4-11,19,21-22H,1-3H3
charge 0 multiplicity 1
49 atoms
O  -4.119805 -1.267701 -0.880662
O  -3.686587 1.137122 -0.884872
O  -0.978994 -1.70514 0.934105
O  0.976938 0.474969 -0.288929
O  0.472382 -3.183776 -0.149712
O  1.48986 4.233108 1.48171
C  -1.828156 -0.478084 -1.130631
C  -1.894104 -1.755146 -0.21942
C  -3.366752 -1.870669 0.283026
C  -3.340993 -0.22924 -1.470008
C  -1.397037 0.821523 -0.484371
C  -2.512476 1.678578 -0.357098
C  -3.656935 -1.087845 1.576289
C  -3.842491 -3.324305 0.377491
C  -0.142991 1.304418 -0.076812
C  -2.43961 2.96593 0.221354
C  -0.01669 2.597932 0.506559
C  -1.178554 3.403225 0.657117
C  0.194612 -2.483269 0.848006
C  1.31648 3.096266 0.924682
C  2.263495 0.949731 0.048948
C  2.428282 2.187127 0.631858
C  1.027159 -2.31784 2.094696
C  3.328103 -0.016485 -0.300069
C  4.677641 0.219657 0.089243
C  3.024675 -1.197274 -1.033257
C  5.691684 -0.695329 -0.251993
C  4.04325 -2.113138 -1.36807
C  5.380674 -1.867111 -0.983564
H  -1.235156 -0.704447 -2.031749
H  -1.63426 -2.638353 -0.830043
H  -3.622893 -0.160277 -2.530314
H  -3.263419 -0.060193 1.545374
H  -4.748689 -1.041325 1.728473
H  -3.196265 -1.599583 2.438394
H  -4.90218 -3.36415 0.681979
H  -3.740436 -3.834477 -0.5957
H  -3.244351 -3.869954 1.129152
H  -3.333643 3.587901 0.307422
H  -1.041719 4.390065 1.111237
H  3.42877 2.543988 0.884312
H  0.391027 -2.177754 2.982283
H  1.660949 -1.419028 1.986309
H  1.686646 -3.189463 2.219566
H  4.94011 1.113115 0.664435
H  1.994451 -1.39813 -1.334263
H  6.72442 -0.497993 0.054958
H  3.787179 -3.02011 -1.925338
H  6.171098 -2.578864 -1.245503
