program: Gaussian 09
title: 000156336
version: EM64L-G09RevD.01
frameworkgroup: C1[X(C20H19N3)]
method: RPBEPBE
basis: SDD
operation: Freq
keyword: #pfreq=noraman
keyword: PBEPBE/SDD
title: #p freq=noraman PBEPBE/SDD
converged: YES YES NO NO
title: Mulliken charges:
elementType: N N N C C C C C C C C C C C C C C C C C C C C H H H H H H H H H H H H H H H H H H H
charge: -0.270867 -0.180789 -0.003578 0.066813 0.207474 -0.333892 -0.515375 0.357774 0.195187 0.171929 -0.420468 0.379634 -0.490329 0.419937 -0.700630 -0.370509 -0.430571 -0.651929 -0.543368 -0.237287 -0.254463 -0.362516 -0.367275 0.208829 0.231319 0.220060 0.214278 0.231206 0.224720 0.229785 0.232683 0.243167 0.230391 0.233201 0.240525 0.234248 0.221439 0.238407 0.222257 0.221917 0.220496 0.236168
chargesum: 0.00000
title: Mulliken charges with hydrogens summed into heavy atoms:
elementType: N N N C C C C C C C C C C C C C C C C C C C C
charge: -0.270867 -0.180789 -0.003578 0.066813 0.207474 -0.125062 -0.063996 0.357774 0.195187 0.171929 0.025017 0.379634 -0.265609 0.419937 0.005004 -0.140118 -0.197370 0.044283 -0.304962 -0.015030 -0.032545 -0.142020 -0.131107
polarizability: 3.59649449e+02 -5.03919503e+00 2.91602852e+02 -3.26205362e+00 -9.39854727e-02 1.32148242e+02
1716.lowfreq: -9.0189 -0.0004 -0.0003 0.0003 2.8707 7.7603 44.5110 56.7829 70.7943
frequency: 44.4757 56.7333 70.7891 114.0313 123.0582 131.4399 157.1933 169.0550 188.7314 206.5162 232.7293 243.2900 251.0105 278.8402 303.2474 309.6484 333.2688 348.1482 357.2925 411.1674 431.6342 453.2248 488.6062 492.3211 534.7535 554.9206 562.8541 581.7281 592.2810 596.4217 620.3813 640.6675 674.2219 677.0345 715.1474 748.2988 752.0878 757.1493 764.9718 792.1700 796.8864 814.5527 846.2238 850.4528 863.6782 916.8566 921.2161 930.6862 954.9580 959.3995 963.0910 970.8584 992.4004 1009.8754 1015.3562 1036.9435 1048.8344 1064.8128 1078.5497 1095.1587 1107.4682 1132.6169 1154.5983 1171.7704 1175.3681 1178.3750 1202.0497 1224.7519 1225.5189 1245.9647 1263.9569 1274.8858 1298.4742 1311.7695 1319.8726 1323.0762 1335.1091 1345.9556 1370.1766 1380.6775 1383.7205 1399.7500 1408.1637 1415.1208 1445.7233 1449.3673 1455.9008 1462.2996 1465.4415 1467.4834 1473.1349 1479.2564 1484.8998 1493.2301 1500.0955 1529.5781 1545.1543 1572.3812 1576.4185 1602.2985 1622.5537 2935.2880 2943.1026 2969.1547 2991.1048 3010.0195 3029.4099 3036.5455 3058.2322 3090.3539 3095.9121 3099.9792 3102.0208 3119.1514 3124.6173 3133.6253 3142.0720 3145.7017 3147.1408 3163.7378
redmass: 4.6993 3.6316 3.6997 3.7496 3.2314 3.4361 3.6964 2.6020 1.6968 3.4867 1.6573 1.4206 3.1160 3.0176 4.0810 4.2757 3.5634 4.8322 3.9710 3.7806 2.9334 3.9067 3.6042 2.9453 4.5769 4.6988 5.2158 4.3646 4.5625 4.4514 5.2650 3.8368 4.8685 5.1174 4.3947 1.4224 3.7212 4.0265 3.4649 2.6446 1.5601 3.1090 1.4957 1.5024 3.4302 1.6123 2.8107 1.3892 2.7390 3.1331 1.4522 1.3080 2.8621 2.1718 2.0895 2.6833 2.1226 2.1879 1.9227 2.2083 1.2879 1.5401 2.1069 2.1184 1.3702 1.3948 1.7391 1.8839 2.2887 1.7755 1.6681 2.3535 1.5765 2.1409 1.4558 2.6847 2.0802 2.2680 1.7092 1.3585 1.4649 2.4046 3.8192 1.9960 1.2336 2.9356 1.2586 1.3558 1.0741 1.4479 1.4952 1.1188 2.2927 3.3218 1.1319 6.3376 5.2010 5.9269 6.4017 7.3113 7.5085 1.0621 1.0474 1.0633 1.0349 1.0982 1.0842 1.0967 1.0941 1.1008 1.0907 1.0952 1.1000 1.0867 1.0849 1.0885 1.0906 1.0933 1.0949 1.1000
irintensity: 0.4152 0.6873 0.5898 1.2319 1.1129 0.6511 1.5418 2.5585 0.5547 1.1702 1.1855 0.7615 6.3072 1.5029 1.0325 0.4211 0.9255 0.5765 2.2650 0.6772 7.0519 0.7939 1.4179 12.2779 4.3514 0.1623 1.8622 0.9003 2.6617 1.6922 18.4669 2.4371 1.0412 0.7074 10.6478 87.0376 2.6915 2.3424 3.4560 13.3124 6.7224 2.1108 2.0651 83.2837 9.8336 1.3109 2.0342 1.0910 5.2606 5.6623 0.4803 0.0268 1.3272 32.8406 7.6805 4.9810 11.6264 9.3405 8.1756 6.9738 2.8441 12.7813 4.0178 8.9724 2.1537 0.9615 33.0118 3.6855 9.7154 37.6076 13.0040 6.9200 7.1756 34.8928 103.8043 80.9675 14.0835 7.9090 26.3273 22.4518 40.8534 20.0229 37.2313 16.9351 1.1132 4.3967 9.8506 9.0295 7.6280 17.6277 15.1650 1.8974 16.5210 34.1515 42.6694 123.3899 42.5278 289.4598 29.7307 190.4964 16.9258 46.3804 117.1551 38.2797 19.8419 36.1235 7.6144 38.9045 44.2759 19.9022 20.6721 27.4093 16.6707 9.8030 1.0361 4.0431 15.4205 51.1560 31.9353 36.1674
temp: 298.150 k
press: 1.00000 atm
elementType: 7 7 7 6 6 6 6 6 6 6 6 6 6 6 6 6 6 6 6 6 6 6 6 1 1 1 1 1 1 1 1 1 1 1 1 1 1 1 1 1 1 1
symmnumber: 1
zpe: 900213.3 jmol-1
zpe.correction: 0.342873 hartree
zpe.thermalcorrener: 0.361245 hartree
zpe.thermalcorrenthalpy: 0.362189 hartree
zpe.thermalcorrgfe: 0.297486 hartree
zpe.sumelectzpe: -936.179850 hartree
zpe.sumelectthermal: -936.161478 hartree
zpe.sumelectthermalent: -936.160534 hartree
zpe.sumelectthermalfe: -936.225237 hartree
dipole: -2.4423 5.3094 1.6676
dipole: 6.0775
quadrupole: -139.8055 -118.3380 -139.1754
quadrupole: 11.6600 3.0158 -5.7161
quadrupole: -7.3658 14.1017 -6.7358 11.6600 3.0158 -5.7161
hfenergy: -936.5227228 hartree
pointgroup: C01 [X(C20H19N3)]
dipole: -1.0050647 -2.0904526 -0.5805478 debye
polarizability: 359.8505232|3.7836759|291.2466265|1.6738286|-5.4668909|132.3033928 unknown
InChI: InChI=1S/C20H19N3/c1-13-17-12-21-9-7-14(17)11-19-20-16(8-10-22(19)2)15-5-3-4-6-18(15)23(13)20/h3-7,9,11-13H,8,10H2,1-2H3
charge 0 multiplicity 1
42 atoms
N  -0.452076 0.606461 -0.317645
N  0.066221 -3.092972 -0.036522
N  4.026656 2.276977 0.565932
C  -0.568554 -0.776398 -0.073285
C  -1.888565 -1.076737 0.29828
C  0.688876 1.277637 -0.983072
C  -2.285894 -2.496385 0.595896
C  0.515699 -1.761762 -0.087098
C  -1.710346 1.193181 -0.106427
C  -2.629666 0.154794 0.300178
C  -1.369743 -3.41583 -0.241966
C  1.998728 1.110151 -0.227446
C  1.880957 -1.464847 -0.02828
C  2.541666 -0.174831 0.113047
C  0.812433 0.823912 -2.464309
C  -2.125029 2.537879 -0.243282
C  -3.979749 0.492349 0.591418
C  1.034669 -4.194217 -0.01582
C  2.766551 2.266841 0.039343
C  -3.469534 2.842769 0.047772
C  -4.388551 1.831735 0.46318
C  3.873902 -0.162069 0.639951
C  4.561626 1.04578 0.842134
H  0.443964 2.355064 -0.981023
H  -2.179328 -2.734048 1.673942
H  -3.340324 -2.686346 0.320332
H  -1.519993 -4.471651 0.042138
H  -1.640135 -3.308186 -1.315407
H  2.566843 -2.314951 0.043352
H  -0.149688 0.962209 -2.989217
H  1.584899 1.42552 -2.974156
H  1.103967 -0.237671 -2.531004
H  -1.436276 3.330843 -0.552556
H  -4.689915 -0.27765 0.913489
H  1.701462 -4.125401 0.866381
H  1.672681 -4.211948 -0.924441
H  0.493957 -5.151839 0.042166
H  2.351278 3.255881 -0.198511
H  -3.816144 3.878232 -0.042823
H  -5.42471 2.110266 0.684793
H  4.356387 -1.108884 0.909055
H  5.579399 1.048642 1.249113
