program: Gaussian 09
title: 000156334
version: EM64L-G09RevD.01
frameworkgroup: C1[X(C13H28N2O)]
method: RPBEPBE
basis: SDD
operation: Freq
keyword: #p
keyword: freq=noraman
keyword: PBEPBE/SDD
title: #p freq=noraman PBEPBE/SDD
converged: YES YES NO NO
title: Mulliken charges:
elementType: O N N C C C C C C C C C C C C C H H H H H H H H H H H H H H H H H H H H H H H H H H H H
charge: -0.215772 -0.290397 0.033182 -0.385432 -0.385524 -0.385342 -0.381043 -0.381617 -0.370829 -0.373405 -0.396879 -0.353088 -0.359192 -0.356912 -0.696438 -0.410520 0.192947 0.195090 0.194872 0.194145 0.194326 0.192699 0.193242 0.195988 0.190992 0.193099 0.195174 0.192881 0.188912 0.190319 0.217843 0.188746 0.187114 0.188222 0.206929 0.227859 0.195136 0.194496 0.209715 0.209613 0.215155 0.283696 0.227898 0.252102
chargesum: 0.00000
title: Mulliken charges with hydrogens summed into heavy atoms:
elementType: O N N C C C C C C C C C C C C C
charge: -0.215772 -0.006701 0.033182 0.002604 0.003493 0.001683 0.008187 0.002473 0.017225 0.005826 0.009711 0.022248 0.075595 0.032720 -0.061955 0.069480
polarizability: 2.38373903e+02 1.16009424e+01 1.35865225e+02 -5.85318396e+00 -4.48362759e-01 1.34038175e+02
1716.lowfreq: -16.8326 -0.7942 -0.0016 -0.0007 0.0011 3.2974 11.6542 17.6518 24.8062
frequency: 11.6433 16.2436 24.7262 32.5343 48.1838 55.4447 64.1862 81.3518 87.4876 93.1070 110.8740 119.2460 130.2008 143.3929 146.0989 150.4967 164.6785 215.5479 226.8373 270.2998 304.2856 337.4339 388.5625 422.3903 442.2526 484.7541 494.8724 541.6841 577.8603 718.6471 720.5222 721.2481 726.4207 737.4377 759.4189 788.7503 834.6205 884.5436 887.7134 937.6635 952.9813 979.0821 988.5288 992.6458 1012.6889 1026.4223 1030.1079 1048.8262 1055.4244 1074.5806 1078.1276 1081.6020 1082.7100 1091.8216 1123.0039 1131.8324 1173.5692 1180.2542 1194.1905 1203.8481 1215.5636 1230.3143 1239.2719 1254.0468 1262.8427 1270.5324 1275.6891 1277.5659 1281.6077 1286.0516 1287.8987 1290.0414 1294.9601 1295.7643 1311.5836 1332.3602 1346.9847 1353.5482 1355.5027 1357.1840 1360.7700 1374.8153 1388.9102 1422.9498 1459.1141 1459.4176 1461.3691 1462.6924 1462.8187 1465.5438 1467.7344 1472.2458 1476.6762 1477.1792 1481.9452 1486.0760 1488.5264 1493.9178 2940.4370 2947.9783 2948.0344 2950.0921 2950.4020 2952.5620 2954.5187 2957.3889 2961.5335 2966.0046 2967.7846 2971.2234 2980.8692 2983.8434 2983.9046 2988.3700 2994.4168 2999.4453 3003.0701 3012.5027 3022.6968 3032.1777 3040.1380 3046.4352 3067.9234 3069.7604 3077.4263 3480.9639
redmass: 5.1188 2.6975 3.4133 2.8204 2.1550 3.0194 2.8557 3.6331 1.9806 4.1295 2.3755 2.2337 2.0840 3.4909 2.2578 2.1460 3.2632 3.1241 1.1306 3.4634 3.5865 3.2569 3.6334 3.3854 3.7468 3.1621 2.9322 2.8180 1.3330 1.0594 3.4018 1.1048 1.0880 1.1069 1.1349 1.1750 1.2125 1.2466 1.8606 1.2319 3.0869 3.5220 1.3497 3.7507 2.6435 2.1697 1.4336 2.3929 3.1287 2.6061 2.3099 2.1167 2.1362 2.4802 2.4424 1.4344 4.1409 1.8628 1.4350 1.4146 1.4087 1.3574 1.3615 1.2926 1.3229 1.1907 1.1865 1.0400 1.0751 1.2359 1.1392 1.1090 1.1202 1.1218 1.3504 1.4123 1.5334 1.7106 1.6971 1.6933 2.2350 2.4151 1.2174 1.0926 1.0762 1.0737 1.2432 1.0806 1.0726 1.0692 1.0799 1.0819 1.0463 1.0792 1.0885 1.0923 1.0946 1.0899 1.0629 1.0586 1.0587 1.0591 1.0592 1.0594 1.0605 1.0609 1.0600 1.0602 1.0585 1.0367 1.0961 1.0560 1.0968 1.0984 1.0996 1.0935 1.1023 1.1039 1.1046 1.1046 1.1044 1.1038 1.1007 1.0993 1.1083 1.0754
irintensity: 0.5816 0.7488 0.4458 0.5747 0.5812 0.5719 0.1889 0.3970 0.9862 0.9863 1.2354 0.3539 0.0104 0.5674 0.3702 0.1509 2.9671 1.3415 0.0199 3.1155 0.8102 4.9562 6.3023 2.5274 14.2692 0.8464 4.4552 8.0718 130.6848 17.3869 2.8935 0.3258 9.1361 0.2461 2.4499 0.5341 0.7067 1.0746 5.3122 0.3935 4.9143 0.3683 0.7187 3.3874 4.5439 1.0151 1.8352 9.0165 0.6423 0.0883 0.8967 0.2550 0.0527 4.7151 31.7491 30.0440 16.2925 2.9885 19.3792 8.4165 0.1322 0.1773 0.2100 0.3371 0.1423 1.0039 0.7206 0.0781 0.4961 0.3587 0.3043 0.4307 0.0229 0.0808 3.1628 7.1007 21.5566 3.4718 14.5095 9.6341 87.4237 48.3654 11.3324 14.1294 0.3328 0.0825 36.5203 4.3505 0.0097 1.0920 0.5731 1.5948 11.1328 1.7327 2.0423 1.2546 32.3750 13.7039 32.8111 0.0486 0.0020 0.0133 0.4836 0.2134 0.2235 4.0583 14.5246 95.0116 262.4841 36.2976 0.0683 35.9597 0.1715 0.3207 1.2918 21.1026 1.6937 0.6043 0.9245 2.3452 99.6892 260.0557 98.5277 55.5608 17.3109 6.8149
temp: 298.150 k
press: 1.00000 atm
elementType: 8 7 7 6 6 6 6 6 6 6 6 6 6 6 6 6 1 1 1 1 1 1 1 1 1 1 1 1 1 1 1 1 1 1 1 1 1 1 1 1 1 1 1 1
symmnumber: 1
zpe: 1032615.5 jmol-1
zpe.correction: 0.393302 hartree
zpe.thermalcorrener: 0.414972 hartree
zpe.thermalcorrenthalpy: 0.415916 hartree
zpe.thermalcorrgfe: 0.337026 hartree
zpe.sumelectzpe: -695.477563 hartree
zpe.sumelectthermal: -695.455893 hartree
zpe.sumelectthermalent: -695.454949 hartree
zpe.sumelectthermalfe: -695.533840 hartree
dipole: -2.8545 -1.8195 0.9463
dipole: 3.5148
quadrupole: -140.3761 -106.5826 -99.9859
quadrupole: -16.0474 8.6612 0.4585
quadrupole: -24.7279 9.0656 15.6623 -16.0474 8.6612 0.4585
hfenergy: -695.8708655 hartree
pointgroup: C01 [X(C13H28N2O1)]
dipole: 1.0981745 0.0355501 -0.8396538 debye
polarizability: 237.4560408|-1.1454309|134.0083611|-16.139724|0.6352879|136.8129006 unknown
InChI: InChI=1S/C13H28N2O/c1-2-3-4-5-6-7-8-9-10-11-12-14-13-15-16/h14H,2-13H2,1H3
charge 0 multiplicity 1
44 atoms
O  -8.4886 -0.10261 1.664729
N  -5.812339 -0.274799 -0.260394
N  -7.424209 0.518998 1.321455
C  1.832961 -0.338366 -0.235384
C  0.547966 0.495555 -0.03364
C  3.130373 0.469554 -0.007803
C  -0.748222 -0.311487 -0.270111
C  4.413194 -0.380559 -0.14768
C  -2.032369 0.514133 -0.032463
C  5.712848 0.429195 0.061007
C  -3.325451 -0.296419 -0.272965
C  6.99151 -0.435743 -0.01272
C  -4.5973 0.530768 -0.005953
C  8.293396 0.375858 0.177201
C  9.562961 -0.502268 0.136714
C  -7.107296 0.374218 -0.191622
H  1.817035 -1.206161 0.457326
H  1.839838 -0.761545 -1.261777
H  0.566039 1.369975 -0.717677
H  0.539386 0.908321 0.99701
H  3.168199 1.314107 -0.727614
H  3.104488 0.925839 1.004122
H  -0.753914 -1.197609 0.398968
H  -0.751105 -0.705708 -1.307743
H  4.379763 -1.213171 0.586293
H  4.433542 -0.853861 -1.151809
H  -2.028751 0.90469 1.006449
H  -2.024917 1.401605 -0.699305
H  5.672912 0.937604 1.047362
H  5.769954 1.234877 -0.700855
H  -3.351363 -0.670402 -1.315084
H  -3.320637 -1.189697 0.387899
H  6.940644 -1.2300 0.761551
H  7.026964 -0.959091 -0.991359
H  -4.62365 1.401445 -0.691855
H  -4.56973 0.934303 1.029716
H  8.355361 1.15473 -0.610275
H  8.247049 0.916391 1.144854
H  9.542909 -1.263502 0.939452
H  9.644653 -1.036546 -0.828846
H  10.479613 0.102147 0.266958
H  -5.78715 -1.213151 0.156062
H  -7.042833 1.390057 -0.62054
H  -7.903321 -0.215775 -0.684854
