program: Gaussian 09
title: 000156328
version: EM64L-G09RevD.01
frameworkgroup: C1[X(C21H23FN2O3S)]
method: RPBEPBE
basis: SDD
operation: Freq
keyword: #p
keyword: freq=noraman
keyword: PBEPBE/SDD
title: #p freq=noraman PBEPBE/SDD
converged: YES YES NO NO
title: Mulliken charges:
elementType: S F O O O N N C C C C C C C C C C C C C C C C C C C C C H H H H H H H H H H H H H H H H H H H H H H H
charge: 0.639058 -0.209094 -0.613747 -0.230169 -0.176712 -0.072272 -0.469129 -0.012305 -0.428890 -0.429488 -0.391991 -0.402710 -0.619096 -0.290804 0.517510 -0.655928 -0.369475 -0.391053 -0.164886 -0.372074 -0.374273 0.312407 -0.341599 -0.215506 0.220527 0.282558 -0.312597 0.165547 0.215726 0.217383 0.195145 0.205484 0.194416 0.211767 0.188038 0.179140 0.212538 0.209567 0.213029 0.238394 0.209746 0.258978 0.298937 0.237305 0.238708 0.253079 0.253549 0.338171 0.244573 0.247040 0.345478
chargesum: 0.00000
title: Mulliken charges with hydrogens summed into heavy atoms:
elementType: S F O O O N N C C C C C C C C C C C C C C C C C C C C C
charge: 0.639058 -0.209094 -0.613747 -0.230169 -0.176712 -0.072272 -0.123651 0.203421 -0.016362 -0.029588 0.007813 -0.011033 -0.196500 0.157335 0.517510 -0.098014 -0.132169 -0.152344 -0.164886 -0.118995 -0.120724 0.312407 -0.003427 0.029067 0.220527 0.282558 -0.065557 0.165547
polarizability: 3.15880483e+02 4.08371611e+01 2.94063382e+02 -3.30650369e+01 7.56595438e+00 2.21311481e+02
1716.lowfreq: -9.1274 -1.9284 -0.0013 0.0002 0.0013 2.8447 8.7421 10.9439 18.7087
frequency: 7.6074 9.7636 18.4953 28.2046 32.1283 43.8476 55.7054 57.8724 92.3055 103.5463 127.7336 131.0996 137.3939 171.4017 191.1456 223.0463 239.3698 247.4091 252.7385 274.0510 291.6256 303.4856 321.5371 344.4396 351.0930 358.5415 386.1552 397.6992 405.4024 411.9633 421.3292 441.1369 449.5340 464.3731 489.8042 523.0081 540.8304 544.0792 581.1483 589.8154 600.0463 618.7445 630.1945 656.6701 675.7416 682.8051 709.8609 741.2706 744.5504 752.2196 769.7496 790.3826 803.2484 805.1513 806.9104 807.6295 818.8136 823.1456 835.6689 845.3117 873.8433 895.7828 925.5826 936.0828 937.5294 945.4804 958.2315 969.8754 970.7841 1004.4630 1006.5401 1019.6097 1027.6815 1057.3603 1060.9698 1068.2829 1080.8051 1102.3804 1115.9523 1119.3599 1127.7162 1134.7934 1154.7194 1155.5531 1180.8346 1188.9433 1195.1400 1197.1715 1214.9807 1219.1878 1234.5987 1252.3084 1253.7821 1262.5090 1268.7697 1286.7351 1295.4643 1302.8317 1314.6870 1321.1074 1329.2371 1337.3032 1345.7144 1352.5175 1366.5079 1382.9518 1389.7518 1406.1378 1411.0354 1421.2758 1428.0937 1446.3581 1457.7571 1464.2829 1469.5732 1469.9542 1472.6649 1482.7930 1494.4153 1601.6257 1612.0967 1613.9769 1625.1702 1760.9089 2833.5643 2847.5732 2908.8284 2945.8496 2968.0233 2973.7237 2981.3277 3020.5747 3025.4174 3028.9644 3034.4008 3037.1967 3040.7529 3049.8321 3124.7475 3127.4635 3132.0135 3133.9740 3138.4740 3166.8614 3171.2427 3174.1140 3618.7547
redmass: 7.5725 5.7893 5.0610 6.4036 4.3455 3.6847 4.6336 5.2592 3.1505 6.4231 5.1624 7.3403 8.2803 5.8057 4.0728 3.0272 2.3594 6.7276 3.7271 5.3800 5.2469 2.8223 6.0231 3.9497 3.8553 3.1973 4.7690 3.6645 6.7291 2.9569 2.2233 3.3012 4.2819 3.0988 3.5012 8.4521 3.5648 5.5509 3.3772 1.1486 3.3439 3.3629 6.8409 8.7928 7.8736 10.5865 3.6361 4.6002 4.4587 2.5845 1.9073 3.7102 1.7907 1.7564 4.9187 1.5964 1.2577 4.1708 5.5189 1.9753 6.0079 1.7600 1.3570 1.5035 1.3346 1.4571 1.3554 2.0733 1.5663 1.6654 2.5138 3.2181 1.9409 2.9704 6.2280 2.0023 1.9842 1.8095 2.6342 1.4911 1.8321 1.3520 1.4467 1.3074 1.4591 4.1695 1.7352 1.5960 3.3690 1.2392 1.6224 1.5402 1.6060 1.2732 1.2583 1.3322 1.2846 1.2571 1.3208 1.3917 2.6282 1.3071 1.4830 1.5336 1.3837 5.4649 1.4135 2.8588 1.1296 3.7332 2.8248 1.0906 1.0933 1.0798 2.0459 1.6284 1.0988 1.0926 2.6876 7.5185 6.5148 8.3145 7.6670 11.0770 1.0713 1.0704 1.0675 1.0816 1.0599 1.0594 1.0615 1.0886 1.1018 1.0914 1.0866 1.1015 1.0579 1.1011 1.0930 1.0899 1.0899 1.1092 1.0896 1.0966 1.0951 1.0959 1.0809
irintensity: 0.0730 1.6355 2.5549 0.6873 3.6595 0.8078 1.1796 0.0364 1.1278 0.6906 2.6814 2.0908 3.4161 0.5894 1.5604 0.0976 1.7239 3.7642 10.1119 5.0664 5.9582 2.5248 3.5472 5.3832 5.8472 1.6930 9.4457 3.1795 5.4262 0.0195 1.5459 10.0146 2.4535 3.9673 15.6350 2.3120 21.0947 5.9158 21.3807 115.2504 10.5273 7.0699 0.0155 8.6559 10.3580 23.7244 2.4388 0.0115 10.3784 19.2837 18.8551 22.9139 27.4799 67.4478 98.1689 13.5198 0.5701 10.1248 34.7335 52.7340 5.0003 0.5086 5.3389 2.4380 21.9538 1.5117 0.2316 22.1459 7.2485 1.6343 5.6439 6.5905 23.9664 31.9285 22.0429 4.2770 1.1487 48.4839 6.8797 39.0946 11.0223 31.8187 38.5605 2.1777 3.8290 42.6112 28.8569 16.6205 5.3010 4.7399 7.8660 6.0434 28.0710 3.3323 10.2337 5.4323 0.1762 11.7506 3.3221 2.5179 113.0607 10.5638 5.3492 9.7424 3.1940 0.4117 9.4357 0.5931 10.2285 4.0529 23.4734 3.7788 6.7238 0.3706 140.3603 50.3205 2.5010 17.1712 114.1166 4.3694 11.0749 20.0370 4.3368 903.4363 71.2342 103.7886 34.8517 11.5633 14.3070 56.1604 32.0569 32.2829 5.3069 47.5748 18.8177 54.2238 17.3676 55.4985 30.6033 12.2600 13.7512 6.3159 3.9771 10.0288 5.4116 2.5024 90.5352
temp: 298.150 k
press: 1.00000 atm
elementType: 16 9 8 8 8 7 7 6 6 6 6 6 6 6 6 6 6 6 6 6 6 6 6 6 6 6 6 6 1 1 1 1 1 1 1 1 1 1 1 1 1 1 1 1 1 1 1 1 1 1 1
symmnumber: 1
zpe: 1054174.4 jmol-1
zpe.correction: 0.401514 hartree
zpe.thermalcorrener: 0.427466 hartree
zpe.thermalcorrenthalpy: 0.428410 hartree
zpe.thermalcorrgfe: 0.339774 hartree
zpe.sumelectzpe: -1644.987337 hartree
zpe.sumelectthermal: -1644.961385 hartree
zpe.sumelectthermalent: -1644.960441 hartree
zpe.sumelectthermalfe: -1645.049077 hartree
dipole: -0.3580 -5.4469 -7.5517
dipole: 9.3180
quadrupole: -187.7870 -187.0411 -173.4162
quadrupole: -1.0303 -34.6195 -5.5643
quadrupole: -5.0389 -4.2930 9.3319 -1.0303 -34.6195 -5.5643
hfenergy: -1645.3888509 hartree
pointgroup: C01 [X(C21H23F1N2O3S1)]
dipole: 0.137269 2.25464 -2.887432 debye
polarizability: 317.4327803|39.2274698|293.6636799|33.607375|-5.504085|220.1588855 unknown
InChI: InChI=1S/C21H23FN2O3S/c22-17-3-1-15(2-4-17)13-16-7-9-24(10-8-16)11-12-28(26)18-5-6-19-20(14-18)27-21(25)23-19/h1-6,14,16,23H,7-13H2
charge 0 multiplicity 1
51 atoms
S  -3.139179 2.419938 1.026361
F  7.650105 -3.632705 0.866549
O  -2.834516 1.743222 2.532212
O  -5.87819 -2.144527 0.968703
O  -7.3393 -3.842596 0.163411
N  0.91836 2.219216 -0.012812
N  -6.804956 -1.875221 -1.096588
C  3.757126 1.457544 -0.350725
C  2.619835 0.412279 -0.265186
C  3.183139 2.796887 -0.873696
C  1.433306 0.947162 0.559801
C  1.975757 3.262443 -0.036172
C  4.943206 0.98085 -1.240358
C  -0.334751 2.675481 0.64065
C  5.667884 -0.243385 -0.699779
C  -1.535121 1.95253 0.01515
C  6.557785 -0.124201 0.40116
C  5.462605 -1.530437 -1.260459
C  -4.281337 1.134777 0.196298
C  7.224545 -1.248501 0.934992
C  6.118033 -2.672499 -0.746056
C  6.985647 -2.501597 0.344752
C  -4.559469 0.004419 0.991334
C  -4.835277 1.35673 -1.080585
C  -5.424677 -0.924453 0.414018
C  -5.99586 -0.744925 -0.875703
C  -5.714227 0.396266 -1.645795
C  -6.768637 -2.759452 -0.005793
H  4.146157 1.625732 0.677862
H  2.990769 -0.525291 0.189652
H  2.265623 0.173033 -1.288065
H  2.858125 2.669104 -1.925599
H  3.964276 3.582824 -0.857489
H  0.617606 0.20169 0.572457
H  1.75709 1.095135 1.623215
H  2.322969 3.513027 1.001065
H  1.547554 4.1846 -0.472138
H  5.657793 1.823166 -1.33854
H  4.555725 0.77268 -2.257354
H  -0.331378 2.50024 1.742457
H  -0.43533 3.765378 0.478375
H  -1.71845 2.254178 -1.028724
H  -1.474031 0.856539 0.104088
H  6.739303 0.862699 0.843727
H  4.784154 -1.64385 -2.114063
H  7.914594 -1.163763 1.77964
H  5.966333 -3.667116 -1.175435
H  -4.109166 -0.084655 1.988498
H  -4.600447 2.267931 -1.641725
H  -6.151939 0.551058 -2.636274
H  -7.366866 -2.073783 -1.921415
