program: Gaussian 09
title: 000156326
version: EM64L-G09RevD.01
frameworkgroup: C1[X(C17H16ClNO)]
method: RPBEPBE
basis: SDD
operation: Freq
keyword: #p
keyword: freq=noraman
keyword: PBEPBE/SDD
title: #p freq=noraman PBEPBE/SDD
converged: YES YES NO NO
title: Mulliken charges:
elementType: Cl O N C C C C C C C C C C C C C C C C C H H H H H H H H H H H H H H H H
charge: -0.065927 -0.325747 -0.051621 -0.313601 -0.292867 -0.437100 -0.411371 0.442563 0.424023 -0.633614 0.146076 0.120263 -0.427531 -0.382718 -0.343835 -0.360799 -0.116021 -0.268302 -0.217500 -0.225307 0.241563 0.236981 0.197296 0.265924 0.249522 0.180858 0.228110 0.187564 0.231301 0.260666 0.235013 0.257378 0.251645 0.227453 0.258696 0.230967
chargesum: 0.00000
title: Mulliken charges with hydrogens summed into heavy atoms:
elementType: Cl O N C C C C C C C C C C C C C C C C C
charge: -0.065927 -0.325747 -0.051621 -0.072038 -0.055886 0.026120 0.019009 0.442563 0.424023 0.013360 0.146076 0.120263 -0.166865 -0.147705 -0.086457 -0.109154 -0.116021 -0.040850 0.041196 0.005660
polarizability: 2.54372834e+02 -1.41426280e+01 1.89896999e+02 7.54243171e+00 2.35160162e+01 1.47257698e+02
1716.lowfreq: -5.4024 0.0019 0.0024 0.0025 4.7057 8.6313 34.1618 54.4284 63.7223
frequency: 34.1065 54.4003 63.6801 94.1566 116.7393 151.5902 165.7919 203.3201 220.4890 234.1036 263.4146 286.9945 294.0365 306.0992 317.3328 366.7168 381.3561 395.6755 423.9181 463.8325 485.0560 512.1949 537.0350 579.1247 584.3487 607.9687 631.3602 669.4578 682.1335 716.1798 729.0094 758.5714 768.0510 770.9716 817.4238 824.5666 836.7328 866.3319 871.5896 880.1339 943.8018 944.8391 946.9232 966.6626 979.7106 992.1400 1017.1582 1037.3219 1040.4373 1072.3045 1083.4819 1092.3110 1107.3944 1108.9900 1141.2581 1164.0325 1168.5283 1182.3670 1188.5865 1196.4034 1214.9425 1218.8587 1232.4435 1234.2498 1247.9055 1257.2363 1284.7827 1312.9068 1334.7508 1351.8697 1354.0184 1376.5998 1380.9601 1411.8911 1431.3122 1435.9906 1466.3006 1467.2762 1476.2411 1478.1979 1487.7318 1498.8729 1575.9333 1585.2263 1605.1304 1615.5959 2815.7962 2844.4050 2891.1864 2996.2107 3014.7002 3016.1429 3026.7699 3036.2855 3073.4326 3110.9948 3136.8378 3148.4769 3154.5613 3159.2088 3170.8438 3178.9840
redmass: 6.3396 3.8483 3.9606 5.2073 4.0183 3.4292 3.9863 2.4487 5.1340 1.4345 3.7165 4.5176 5.8219 4.1904 3.2794 4.1576 4.8751 3.5362 5.4541 3.4788 3.4250 4.8279 4.3262 4.3824 4.8574 4.5178 6.6825 5.9627 4.9387 3.7244 3.7415 2.4240 1.8925 2.8251 3.3370 1.8528 3.4182 1.5880 4.2505 1.4537 1.3714 2.7514 1.3912 2.6852 1.3189 1.7713 2.0222 2.3724 1.9024 2.4256 2.7896 2.1244 1.2883 1.6935 1.3787 1.9538 1.1120 1.4565 2.5931 1.5839 2.4238 1.8200 2.0433 1.4777 1.8557 1.5526 1.2651 1.6873 1.5053 1.5727 1.5686 6.9007 6.3635 2.9666 2.3229 1.1705 1.4363 1.6408 1.4313 1.4449 1.1484 1.0939 6.7972 6.9234 8.1272 6.9379 1.0711 1.0582 1.0717 1.0833 1.0847 1.0716 1.0901 1.0887 1.1010 1.0881 1.0880 1.0924 1.0938 1.0887 1.0998 1.0977
irintensity: 0.0093 1.3801 0.1149 0.9806 0.3192 0.1476 1.2082 0.8539 1.0204 1.7912 3.9763 0.7689 3.9266 4.0652 1.3135 0.1320 2.6406 2.1351 4.9685 8.3936 6.0565 4.4372 1.6195 1.3410 11.5571 4.9318 3.0594 4.0432 12.1101 5.8890 2.1798 26.0546 64.8349 7.4269 17.2964 53.2125 7.6487 2.8879 3.5878 15.0917 0.7485 15.5147 5.7130 7.4158 0.0657 0.7162 4.0149 4.2116 24.7147 39.1021 7.3658 17.0272 9.1160 48.8100 9.0143 2.0191 1.8500 23.4170 226.8860 10.4451 80.2760 16.2725 5.5073 3.9763 22.0696 2.2653 2.5744 4.1341 4.3841 1.4085 5.8062 1.4361 11.8666 21.1038 42.9459 0.3081 155.3386 80.5729 6.2676 27.7176 3.5415 11.4313 7.5104 14.8160 4.0198 5.4164 102.4754 196.3681 116.1036 12.1651 42.6107 32.0203 38.5925 29.1931 27.2586 10.2177 8.7105 2.3400 24.6650 1.3134 16.8556 2.7886
temp: 298.150 k
press: 1.00000 atm
elementType: 17 8 7 6 6 6 6 6 6 6 6 6 6 6 6 6 6 6 6 6 1 1 1 1 1 1 1 1 1 1 1 1 1 1 1 1
symmnumber: 1
zpe: 750373.8 jmol-1
zpe.correction: 0.285802 hartree
zpe.thermalcorrener: 0.302319 hartree
zpe.thermalcorrenthalpy: 0.303263 hartree
zpe.thermalcorrgfe: 0.241446 hartree
zpe.sumelectzpe: -1245.992653 hartree
zpe.sumelectthermal: -1245.976136 hartree
zpe.sumelectthermalent: -1245.975192 hartree
zpe.sumelectthermalfe: -1246.037009 hartree
dipole: 2.0119 0.8436 0.9836
dipole: 2.3931
quadrupole: -129.4089 -112.4499 -121.8183
quadrupole: 1.4066 7.3748 5.5201
quadrupole: -8.1832 8.7758 -0.5926 1.4066 7.3748 5.5201
hfenergy: -1246.2784552 hartree
pointgroup: C01 [X(C17H16Cl1N1O1)]
dipole: 0.8138821 -0.3108844 -0.3569034 debye
polarizability: 254.8579343|12.8229084|187.0061649|-0.3317436|26.6360628|149.6634319 unknown
InChI: InChI=1S/C17H16ClNO/c1-19-9-14-12-4-2-3-5-16(12)20-17-7-6-11(18)8-13(17)15(14)10-19/h2-8,14-15H,9-10H2,1H3
charge 0 multiplicity 1
36 atoms
Cl -5.435315 -0.171355 -1.124842
O  -0.013912 0.735535 1.350062
N  1.707513 -2.377106 0.468447
C  -0.291414 -1.473167 -0.557709
C  0.996536 -0.842773 -1.186485
C  0.23599 -2.307407 0.664089
C  2.012483 -1.992839 -0.922426
C  -1.431993 -0.53849 -0.221841
C  1.52235 0.484294 -0.633351
C  2.372649 -3.575639 0.983797
C  -1.264271 0.511893 0.716202
C  1.092113 1.150694 0.542275
C  -2.720377 -0.727627 -0.778778
C  2.614619 1.073432 -1.329219
C  -2.340403 1.3275 1.11721
C  1.759451 2.294729 1.036022
C  -3.787399 0.101707 -0.38569
C  3.280729 2.224426 -0.864614
C  -3.624899 1.126508 0.565021
C  2.86077 2.831771 0.342049
H  -0.662643 -2.193379 -1.311366
H  0.844601 -0.717735 -2.275558
H  -0.241185 -3.316317 0.657506
H  -0.00031 -1.824084 1.629022
H  3.063233 -1.667182 -1.020211
H  1.836073 -2.823008 -1.658462
H  3.466586 -3.481034 0.860049
H  2.04705 -4.520322 0.475614
H  2.165842 -3.685259 2.06361
H  -2.887259 -1.529692 -1.505153
H  2.95452 0.595129 -2.257164
H  -2.161846 2.117136 1.852842
H  1.387713 2.748818 1.95965
H  4.119536 2.64049 -1.432657
H  -4.468968 1.754898 0.862102
H  3.372334 3.719857 0.728259
