program: Gaussian 09
title: 000156324
version: EM64L-G09RevD.01
frameworkgroup: C1[X(C11H7N3O3)]
method: RPBEPBE
basis: SDD
operation: Freq
keyword: #p
keyword: freq=noraman
keyword: PBEPBE/SDD
title: #p freq=noraman PBEPBE/SDD
converged: YES YES NO NO
title: Mulliken charges:
elementType: O O O N N N C C C C C C C C C C C H H H H H H H
charge: -0.270082 -0.225815 -0.225643 -0.279891 -0.060886 0.049003 0.372147 0.190011 0.247157 -0.434118 -0.203178 -0.333422 -0.299294 -0.221615 0.285034 -0.313489 -0.177533 0.263151 0.321873 0.266967 0.264453 0.243060 0.293182 0.248929
chargesum: 0.00000
title: Mulliken charges with hydrogens summed into heavy atoms:
elementType: O O O N N N C C C C C C C C C C C
charge: -0.270082 -0.225815 -0.225643 -0.279891 -0.060886 0.049003 0.372147 0.190011 0.247157 -0.170967 0.118695 -0.066455 -0.034841 0.021445 0.285034 -0.020307 0.071395
polarizability: 3.18819105e+02 6.42269698e+00 1.89673543e+02 -3.13338730e-02 -5.21221394e-04 5.61845249e+01
1716.lowfreq: -2.2057 0.0001 0.0003 0.0004 3.4999 4.5199 41.3333 61.6764 68.9847
frequency: 41.3287 61.6764 68.9819 97.7738 148.4056 193.5685 216.6699 231.5637 296.6602 319.1671 348.4397 428.8188 454.6499 488.7387 538.9929 554.0674 574.2799 584.6419 625.5427 634.2808 661.8233 673.7126 728.5851 748.0799 763.8220 769.2091 796.2992 857.9763 863.8993 869.1959 871.9468 901.0403 917.2809 957.0662 971.2557 985.3596 1017.4337 1022.9948 1101.0610 1118.7888 1128.1316 1155.2470 1182.0036 1198.9999 1253.1336 1267.4487 1281.2679 1319.3819 1323.7742 1328.7772 1341.0835 1384.8789 1434.8362 1438.7223 1500.3619 1517.9974 1527.0595 1611.5090 1635.9994 3160.8161 3182.1740 3194.0478 3216.2443 3218.9668 3232.8192 3257.5961
redmass: 6.0125 8.7950 8.3286 6.0598 7.3169 8.1258 4.3188 5.8610 9.5169 5.9347 6.7940 2.9690 8.0585 6.7167 7.9929 5.8143 3.7393 6.5328 4.1576 7.0042 5.2844 5.3888 12.8023 3.7827 5.4044 1.4620 1.3609 1.3865 7.4718 1.4175 7.0577 1.3624 7.6202 1.3429 5.0096 1.2966 2.1027 1.4279 3.3637 1.8886 5.2321 1.7340 1.6995 1.7306 2.6495 4.6741 2.8017 4.1345 1.7674 6.8844 4.4083 4.0638 3.4810 3.1631 4.2160 6.9729 5.7211 8.9065 6.7509 1.0887 1.0918 1.0976 1.0986 1.0977 1.0955 1.1034
irintensity: 7.2358 0.3366 4.8623 0.8546 0.0083 0.1611 0.9752 0.0483 1.9537 0.1829 3.2515 14.7691 5.3024 6.2862 1.9521 0.3414 0.9236 0.8671 0.0221 0.3552 2.8460 8.7994 8.0526 12.0396 2.9652 84.7638 69.5833 21.2178 7.7485 8.8705 8.9258 3.3725 4.8029 3.7547 12.9915 0.0428 6.5768 26.2816 9.2034 32.5580 260.3093 45.2770 10.6885 1.5791 475.5328 116.2004 104.9195 120.4314 25.7292 49.1698 56.7243 12.9722 30.2238 17.0318 56.6873 257.5429 11.1933 325.0020 19.6711 4.1932 2.5345 2.8878 6.7331 1.4904 0.3270 6.2289
temp: 298.150 k
press: 1.00000 atm
elementType: 8 8 8 7 7 7 6 6 6 6 6 6 6 6 6 6 6 1 1 1 1 1 1 1
symmnumber: 1
zpe: 435430.9 jmol-1
zpe.correction: 0.165847 hartree
zpe.thermalcorrener: 0.178609 hartree
zpe.thermalcorrenthalpy: 0.179553 hartree
zpe.thermalcorrgfe: 0.125331 hartree
zpe.sumelectzpe: -812.009370 hartree
zpe.sumelectthermal: -811.996608 hartree
zpe.sumelectthermalent: -811.995664 hartree
zpe.sumelectthermalfe: -812.049887 hartree
dipole: -4.0111 1.7708 -0.0062
dipole: 4.3846
quadrupole: -112.8109 -90.1772 -99.3943
quadrupole: 26.6536 0.0006 0.0187
quadrupole: -12.0168 10.6170 1.3998 26.6536 0.0006 0.0187
hfenergy: -812.1752172 hartree
pointgroup: C01 [X(C11H7N3O3)]
dipole: -1.575127 -0.7002804 0.065813 debye
dipolederiv: -0.1298921 0.1371938 -0.0020702 -0.0479904 -0.4518058 0.0100614 0.0025597 0.0048071 -0.095887 -1.4975607 -0.1285063 0.0391664 0.0558583 -0.3972724 0.0024502 0.0341613 0.0077347 -0.2500381 -0.2976312 0.1285376 -0.0020042 -0.5288907 -0.8821515 0.0325354 0.0149995 0.0131075 -0.2407213 0.3348757 -0.5038994 0.0032303 -0.6241596 -0.2564975 0.025489 0.0064888 0.0219278 0.0474149 -1.0222319 -0.058529 0.0240074 0.8524768 -0.503794 -0.0194325 0.0030475 0.0075727 -0.2543439 2.1134125 0.3367386 -0.0632915 1.2854824 1.4403801 -0.0704845 -0.086949 -0.0421334 0.2043968 -1.2888502 0.0243809 0.038317 -0.2006849 -0.1950708 0.0108847 0.0425012 0.0043883 0.0186826 -0.2422982 0.1870266 0.0046888 -0.8402108 0.57501 0.0130062 0.0285618 -0.0173484 0.0660577 1.7593814 -0.0977901 -0.0465302 -0.4598418 0.1349475 0.0129114 -0.0370879 0.0022321 0.1100515 1.1057485 0.1677236 -0.039896 0.340874 0.2464155 -0.0185847 -0.044297 -0.0136613 -0.1137478 -0.0644112 0.0179523 -0.0005677 0.2425771 0.0858254 -0.010587 -0.0057257 -0.0041911 -0.0690625 -1.0526301 -0.1462691 0.0286736 0.4396411 0.0098446 -0.0181479 0.0144417 -0.0009356 -0.2090009 0.0826352 0.0515285 -0.0073629 0.3399425 -0.0832089 -0.0110672 -0.0139337 -0.0026109 -0.1293698 0.2014889 -0.0357015 -0.0098394 0.0287436 0.0775103 -0.0062462 -0.0114276 -0.0043155 -0.1597593 -0.7066226 -0.2340195 0.0279803 -1.3893462 -0.4653817 0.0543579 0.05589 0.0200986 0.0601011 0.4591965 0.1295007 -0.0195649 0.678613 0.2938553 -0.0296082 -0.0329332 -0.0135845 -0.101646 -0.1811331 0.0322548 0.000678 -0.2087876 0.0382684 0.0022601 0.0061929 -0.0048425 -0.1315595 0.0979269 0.0661803 0.0003636 0.0604435 0.0068346 0.0019052 0.0006234 0.0018784 0.1633809 0.0803621 -0.0464361 0.0042635 -0.0102136 0.093736 0.0024471 0.0034261 0.0035325 0.1864367 0.098046 -0.069778 0.0044967 -0.0366099 0.0279787 0.0050674 0.0037831 0.0060841 0.1953496 0.0000908 -0.0248841 0.0056287 -0.0570034 0.0842131 0.003711 0.0063036 0.0027564 0.1728976 0.090712 -0.0451654 0.0033364 -0.0163601 -0.0376299 0.0051684 0.0026876 0.006019 0.1678137 0.0724166 0.0240485 0.0030479 -0.0045898 0.1346866 0.0015981 0.0037126 0.0008147 0.1970447 -0.0130316 0.0879124 0.0032483 0.1000366 0.0233066 0.0003047 0.0029735 0.0006693 0.1655082 unknown
polarizability: 318.6299087|-6.1948828|189.5671142|-7.5981341|-2.9954969|56.4801494 unknown
InChI: InChI=1S/C11H7N3O3/c15-14(16)11-5-4-9(17-11)8-7-12-10-3-1-2-6-13(8)10/h1-7H
charge 0 multiplicity 1
24 atoms
O  1.345106 0.18552 -0.147995
O  4.88724 0.723277 -0.26428
O  3.120217 2.208174 -0.253418
N  -1.578446 0.068534 -0.059108
N  -2.948163 -1.792009 0.024768
N  3.616746 1.007468 -0.235798
C  -0.741823 -1.070527 -0.056692
C  -2.927856 -0.419954 -0.007776
C  0.687512 -1.064406 -0.098806
C  -1.63175 -2.179002 -0.004991
C  -1.294866 1.431308 -0.098877
C  1.651883 -2.091227 -0.102506
C  -3.995081 0.510514 0.002133
C  -2.352345 2.332974 -0.088236
C  2.721945 -0.097846 -0.181336
C  2.937822 -1.474042 -0.154454
C  -3.710429 1.879598 -0.03775
H  -1.354608 -3.231824 0.011719
H  -0.245642 1.723016 -0.136702
H  1.445256 -3.158532 -0.071144
H  -5.014888 0.121044 0.040831
H  -2.122739 3.400882 -0.119323
H  3.910468 -1.958516 -0.17102
H  -4.524661 2.610074 -0.030438
