program: Gaussian 09
title: 000156317
version: EM64L-G09RevD.01
frameworkgroup: C1[X(C20H18O2)]
method: RPBEPBE
basis: SDD
operation: Freq
keyword: #pfreq=noraman
keyword: PBEPBE/SDD
title: #p freq=noraman PBEPBE/SDD
converged: YES YES NO NO
title: Mulliken charges:
elementType: O O C C C C C C C C C C C C C C C C C C C C H H H H H H H H H H H H H H H H H H
charge: -0.454352 -0.427674 0.123969 0.094590 0.285902 -0.264563 0.316595 -0.003578 -0.231914 -0.017923 0.250176 0.299151 -0.453856 -0.444853 -0.311439 -0.197297 -0.875106 -0.830275 -0.397487 -0.436183 -0.268718 -0.265632 0.209052 0.233477 0.245838 0.255339 0.258243 0.223715 0.286147 0.241922 0.223613 0.236548 0.236150 0.237756 0.253322 0.227069 0.351967 0.228360 0.228009 0.333940
chargesum: 0.00000
title: Mulliken charges with hydrogens summed into heavy atoms:
elementType: O O C C C C C C C C C C C C C C C C C C C C
charge: -0.102385 -0.093735 0.123969 0.094590 0.285902 -0.055511 0.316595 -0.003578 0.001563 -0.017923 0.250176 0.299151 -0.208018 -0.189514 -0.053196 0.026418 -0.123425 -0.119822 -0.144165 -0.209113 -0.040358 -0.037622
polarizability: 3.99101863e+02 -6.69875930e+00 2.50241519e+02 5.64224910e+00 -8.51114310e+00 1.15392403e+02
1716.lowfreq: -32.2598 -10.7272 -0.0008 -0.0007 -0.0004 3.0432 7.9627 43.0589 49.0535
frequency: -31.8993 43.0305 49.0383 72.5787 86.2957 117.4578 139.5160 149.3291 168.7828 189.1515 224.8807 238.3692 260.2930 264.5121 287.4694 320.2810 322.4114 345.7808 358.4431 387.1311 391.3135 427.8735 439.7305 464.3154 476.9221 493.4242 510.9955 536.1296 558.7442 574.6480 588.6233 608.8562 633.0421 644.5696 661.6068 709.5803 753.8218 759.8318 769.6216 787.5914 795.8729 812.4003 829.7607 868.2777 875.3216 881.2992 912.4014 929.2505 959.6791 967.8899 978.0069 980.5094 987.1984 991.6719 1020.0319 1032.8370 1035.8364 1051.6659 1060.1345 1062.9368 1078.3197 1117.0747 1169.7395 1172.5616 1180.2743 1185.9016 1188.4878 1207.4505 1234.6205 1246.6160 1260.8955 1294.9904 1313.9772 1323.7255 1324.9821 1358.2002 1373.1850 1378.3071 1392.4403 1398.1232 1403.4215 1416.4816 1425.9963 1437.9000 1450.5038 1465.0564 1478.0957 1482.3487 1498.2537 1507.8515 1529.6862 1554.8844 1564.9141 1598.7200 1623.6349 1641.6492 2945.4718 2969.9109 2980.1931 2983.2834 3047.5290 3051.3110 3106.8076 3118.0903 3120.3981 3128.7282 3144.7768 3145.3351 3162.9647 3169.9132 3171.8074 3176.5545 3530.2837 3565.4656
redmass: 1.4860 3.8077 3.9082 4.0634 2.6598 2.8066 1.6657 2.8578 3.7955 3.2084 4.1980 3.9865 1.3148 1.1983 3.8941 4.3665 3.9574 3.0326 3.8991 3.3012 3.2285 3.4302 4.4927 5.1872 3.8192 4.2789 5.2745 4.2548 3.9037 4.0736 4.5876 3.7594 4.5849 5.5170 4.5736 3.9966 2.5583 1.4904 3.0586 1.9390 4.2295 2.6364 1.8267 4.1167 2.0396 3.2594 3.9055 4.1358 1.3590 1.3754 4.9283 2.1545 1.3339 1.5107 2.4744 1.5291 1.5907 2.8567 1.8861 2.3141 2.7282 2.3189 1.2465 1.4843 1.1676 1.0983 1.2215 1.7010 1.4894 1.5412 1.1241 2.2096 2.2531 3.0902 1.6001 1.9960 2.6428 4.2773 2.3341 1.2517 1.2220 2.3132 2.3370 6.1155 2.4737 1.3529 1.2588 1.0501 1.1676 1.6353 5.5187 6.2294 5.7607 6.5573 5.9007 7.0339 1.0839 1.0438 1.0420 1.0841 1.0974 1.0929 1.0962 1.0893 1.0925 1.0855 1.0890 1.0866 1.0932 1.0935 1.0983 1.0969 1.0661 1.0666
irintensity: 98.7485 9.9780 0.5253 7.0469 2.1794 0.2210 2.0731 0.7687 9.1263 1.7015 0.5678 0.3223 21.6327 149.4534 18.7030 6.4939 11.1780 1.2706 0.1760 0.8943 4.1246 1.9446 2.2150 4.5131 1.2441 7.1755 1.1976 0.3479 8.6922 2.6385 4.1293 1.3039 0.5958 2.1896 1.5423 24.9916 20.0673 87.5252 11.0041 6.9352 2.2901 4.5618 35.4283 1.6606 0.7842 7.6384 88.9509 31.5645 0.7048 5.1436 71.6793 20.6293 0.1401 5.9293 13.6760 2.7851 1.3423 8.0516 4.6938 0.2002 0.1009 16.2277 33.8152 1.3120 4.2999 33.7281 32.7756 1.0156 32.7332 6.8904 5.3803 6.8839 3.4866 8.1963 4.8189 58.3748 17.2299 10.0061 18.2723 10.7812 13.0458 2.9134 11.2531 1.7516 6.9774 4.6762 9.5604 11.9218 21.6466 18.0678 2.6500 2.0278 0.2038 1.5268 4.4246 1.7603 62.0939 31.2315 36.4876 34.9025 17.4591 18.2602 9.1045 13.5873 15.3891 1.9374 8.4547 2.5309 32.2527 19.8165 39.4796 19.9857 3.3526 7.3371
temp: 298.150 k
press: 1.00000 atm
elementType: 8 8 6 6 6 6 6 6 6 6 6 6 6 6 6 6 6 6 6 6 6 6 1 1 1 1 1 1 1 1 1 1 1 1 1 1 1 1 1 1
symmnumber: 1
zpe: 841256.3 jmol-1
zpe.correction: 0.320418 hartree
zpe.thermalcorrener: 0.338768 hartree
zpe.thermalcorrenthalpy: 0.339712 hartree
zpe.thermalcorrgfe: 0.274916 hartree
zpe.sumelectzpe: -921.818194 hartree
zpe.sumelectthermal: -921.799844 hartree
zpe.sumelectthermalent: -921.798899 hartree
zpe.sumelectthermalfe: -921.863695 hartree
dipole: 1.3176 1.4158 0.0964
dipole: 1.9364
quadrupole: -117.7359 -113.8073 -135.4996
quadrupole: -2.9482 4.5518 -4.4524
quadrupole: 4.6117 8.5403 -13.1520 -2.9482 4.5518 -4.4524
hfenergy: -922.1386112 hartree
pointgroup: C01 [X(C20H18O2)]
dipole: 0.510713 -0.5634479 -0.0459742 debye
polarizability: 399.2432352|4.7454015|250.2872046|-6.0096716|-6.6494392|115.2053449 unknown
InChI: InChI=1S/C20H18O2/c1-11-13-5-3-4-6-14(13)12(2)19-15(11)7-8-17-16(19)9-10-18(21)20(17)22/h3-10,18,20-22H,1-2H3
charge 0 multiplicity 1
40 atoms
O  -4.281908 -1.09029 -1.437291
O  -4.605717 1.238191 1.414307
C  -0.009118 0.074741 0.03288
C  -1.451311 0.280102 -0.127334
C  -2.340897 -0.791823 0.081415
C  -3.837614 -0.617666 -0.093309
C  0.480659 -1.305653 0.121372
C  0.939876 1.142409 0.127013
C  -4.352964 0.834883 0.008393
C  1.877692 -1.606926 0.079679
C  2.337842 0.844211 0.021503
C  2.814265 -0.5370 -0.049978
C  -1.843684 -2.107981 0.339686
C  -0.480348 -2.365824 0.300166
C  -2.032728 1.549778 -0.608745
C  -3.369086 1.819485 -0.565863
C  0.535178 2.573635 0.465284
C  2.32432 -3.057658 0.188887
C  3.315828 1.905372 -0.030443
C  4.234182 -0.758219 -0.2010
C  4.674665 1.647507 -0.174939
C  5.139924 0.294695 -0.26498
H  -4.360517 -1.2348 0.669536
H  -5.297764 0.866565 -0.573392
H  -2.556364 -2.921401 0.525483
H  -0.127025 -3.392713 0.421646
H  -1.363849 2.279943 -1.07046
H  -3.759191 2.769234 -0.945617
H  -0.476543 2.619153 0.893338
H  1.223353 2.984693 1.225038
H  0.56805 3.258518 -0.405339
H  3.415882 -3.170549 0.141742
H  1.894774 -3.677644 -0.620515
H  1.998938 -3.502226 1.148625
H  2.977356 2.944157 0.011648
H  4.615744 -1.779542 -0.278968
H  -3.590489 -1.698965 -1.802223
H  5.390441 2.475012 -0.230927
H  6.209768 0.093222 -0.387785
H  -5.419021 0.765977 1.732366
