program: Gaussian 09
title: 000156312
version: EM64L-G09RevD.01
frameworkgroup: C1[X(C17H24O7)]
method: RPBEPBE
basis: SDD
operation: Freq
keyword: #pfreq=noraman
keyword: PBEPBE/SDD
title: #p freq=noraman PBEPBE/SDD
converged: NO YES NO NO
title: Mulliken charges:
elementType: O O O O O O O C C C C C C C C C C C C C C C C C H H H H H H H H H H H H H H H H H H H H H H H H
charge: -0.320008 -0.243107 -0.423259 -0.457370 -0.242461 -0.454947 -0.287514 0.236769 0.353414 0.277642 -0.368314 -0.203588 -0.476572 -0.114368 -0.185660 -0.795455 -0.538908 -0.478008 -0.209020 -0.438530 0.394308 -0.796797 0.337315 -0.758901 0.277758 0.242377 0.233593 0.231263 0.268483 0.245570 0.259715 0.227257 0.215765 0.233760 0.243028 0.242543 0.268523 0.216174 0.230653 0.350806 0.373076 0.224286 0.226559 0.248313 0.368072 0.260214 0.252964 0.252591
chargesum: 0.00000
title: Mulliken charges with hydrogens summed into heavy atoms:
elementType: O O O O O O O C C C C C C C C C C C C C C C C C
charge: -0.320008 -0.243107 -0.072454 -0.084294 -0.242461 -0.086875 -0.287514 0.236769 0.353414 0.277642 -0.090556 0.038789 -0.011717 0.154115 0.059910 -0.092719 -0.062119 0.033057 0.007154 -0.207877 0.394308 -0.097639 0.337315 0.006867
polarizability: 2.26443261e+02 -6.18740488e+00 1.92061284e+02 -3.05709030e+00 -5.90745928e+00 1.70505930e+02
1716.lowfreq: -12.3562 -8.9213 -0.0009 -0.0007 -0.0004 6.4734 33.1907 46.3722 51.0547
frequency: 33.1828 46.3506 51.0352 63.0599 80.9712 86.6729 98.3430 124.4457 132.1635 142.9041 166.6195 184.8028 197.5284 210.8051 228.9265 238.4858 246.2800 252.4824 258.4930 270.3528 282.3570 297.9680 312.0968 317.8013 342.6767 358.1798 363.3219 391.8217 407.3350 411.8395 435.9498 458.0306 467.8768 501.9489 512.3232 523.3336 545.7114 556.7128 575.2745 598.0527 606.6150 628.9817 654.2026 682.1108 719.3241 729.4884 766.3401 780.3538 800.8629 814.7464 841.1145 845.7354 857.3412 869.4239 884.9280 891.6235 903.2497 922.5167 947.4791 956.6707 978.9691 984.6703 994.8081 1006.2043 1010.9891 1030.9175 1041.9359 1046.5988 1046.6413 1050.3315 1059.1593 1084.1055 1108.1754 1124.9323 1136.8083 1142.5321 1151.9742 1169.2727 1184.1693 1192.4160 1195.3157 1200.7837 1219.6062 1225.5157 1243.3088 1263.8041 1269.2821 1274.8306 1283.6293 1302.8637 1319.1857 1329.1946 1337.1634 1340.9272 1362.1871 1364.0026 1369.2346 1377.2985 1385.7790 1390.8683 1393.4344 1399.9721 1413.2944 1445.5046 1453.0673 1455.1327 1455.5197 1464.1470 1471.3977 1481.7063 1486.7455 1497.6580 1622.9579 1687.8154 2957.3954 2973.4282 2998.7189 3007.9462 3010.8402 3019.1786 3022.0803 3024.8124 3054.4978 3065.3436 3078.1546 3081.3930 3085.9010 3088.1699 3091.8440 3096.3605 3099.4818 3116.7100 3120.9239 3142.8726 3167.1647 3420.5556 3491.4941 3523.9877
redmass: 3.9461 2.6854 1.3230 4.8670 4.1181 5.6577 3.5576 4.9780 6.1234 1.2515 5.1230 3.9563 4.7356 3.5717 1.1743 4.4951 3.0291 3.9001 3.0986 4.4819 3.7060 5.1917 3.6225 2.7868 3.3248 2.7603 2.8200 3.6157 2.1347 2.1032 1.2235 3.9094 3.5634 3.6095 4.9250 3.5599 3.8980 2.9708 3.2563 4.3716 2.9100 3.0524 1.6089 3.5627 5.4000 4.5138 3.6206 2.8749 4.3617 3.5338 3.4406 2.9588 3.1930 2.9657 2.3593 2.9154 2.3890 1.5652 3.1149 3.9626 4.5945 2.4452 4.0958 1.9135 3.5653 2.7762 1.6935 1.3636 1.6170 2.7634 2.0453 2.1362 1.9001 1.8345 1.5972 1.8767 2.7078 1.8133 1.8742 2.4023 1.3637 2.9901 1.7504 1.5362 1.6058 1.3464 1.2176 1.2622 2.8460 1.4050 1.2481 1.4247 1.2720 1.3314 1.2919 1.4567 1.2899 1.3941 1.2325 1.3448 1.4590 1.4111 1.4597 1.0812 1.0478 1.0574 1.0611 1.0741 1.0637 1.3468 1.0892 1.0559 8.9907 7.0937 1.0835 1.0384 1.0790 1.0378 1.0371 1.0647 1.0856 1.0567 1.0937 1.0538 1.0997 1.0874 1.0902 1.1035 1.1005 1.0985 1.0950 1.0913 1.0983 1.1020 1.1182 1.0686 1.0660 1.0661
irintensity: 8.4815 1.2297 0.8571 1.6251 2.0765 2.8082 1.8302 3.9138 10.4180 2.6962 1.5928 0.2640 18.2970 40.2189 0.3780 7.8266 6.1962 17.0046 1.1626 2.7965 0.8722 11.6985 0.8085 1.4320 18.2618 19.8133 3.2991 2.2568 15.8740 35.5608 138.1954 19.2819 49.8842 3.7756 6.8159 8.3271 9.2068 26.9769 38.8872 3.1017 53.5824 22.8526 72.6863 22.9720 7.1221 11.7427 3.5030 8.9728 18.9936 17.2946 7.7288 3.5865 32.4198 0.0332 1.8303 12.3038 92.2679 19.4907 11.9758 136.4798 47.9639 24.0708 115.2107 45.9644 57.3862 14.0967 1.6587 3.8485 8.9176 7.9574 13.8634 16.8093 0.3125 1.3055 22.4415 4.7174 9.2619 27.6566 6.3888 66.7859 16.6445 94.2759 106.0148 119.0596 24.7278 5.8709 8.4801 6.0507 1.5832 5.6484 10.9399 18.0056 20.5413 13.5548 1.7914 10.6009 26.1919 4.5159 65.0548 19.6590 15.7989 15.1506 13.2187 3.1790 13.6570 16.7919 17.3685 21.4282 18.5530 5.3947 19.9536 14.6708 168.3801 16.3286 14.9347 24.5253 18.5634 0.6632 15.2753 32.3621 17.1307 10.8476 15.3974 19.1859 13.6914 21.5912 13.7250 7.0936 15.9940 23.7995 5.0963 23.3728 9.7966 6.4328 12.7999 139.7248 13.6247 12.1720
temp: 298.150 k
press: 1.00000 atm
elementType: 8 8 8 8 8 8 8 6 6 6 6 6 6 6 6 6 6 6 6 6 6 6 6 6 1 1 1 1 1 1 1 1 1 1 1 1 1 1 1 1 1 1 1 1 1 1 1 1
symmnumber: 1
zpe: 1022481.9 jmol-1
zpe.correction: 0.389443 hartree
zpe.thermalcorrener: 0.413467 hartree
zpe.thermalcorrenthalpy: 0.414411 hartree
zpe.thermalcorrgfe: 0.337645 hartree
zpe.sumelectzpe: -1186.826856 hartree
zpe.sumelectthermal: -1186.802832 hartree
zpe.sumelectthermalent: -1186.801888 hartree
zpe.sumelectthermalfe: -1186.878654 hartree
dipole: -0.9703 0.4325 2.6248
dipole: 2.8316
quadrupole: -160.0719 -135.1757 -144.9165
quadrupole: 11.3842 9.7770 -3.8660
quadrupole: -13.3505 11.5457 1.8049 11.3842 9.7770 -3.8660
hfenergy: -1187.2162989 hartree
pointgroup: C01 [X(C17H24O7)]
dipole: -0.3359459 -0.3468797 -1.00396 debye
polarizability: 225.29722|9.0609246|190.8078457|3.9372577|-8.4693124|172.905409 unknown
InChI: InChI=1S/C17H24O7/c1-8-4-11-16(5-10(8)19,6-22-9(2)18)15(3)13(21)12(20)14(24-11)17(15)7-23-17/h4,10-14,19-21H,5-7H2,1-3H3
charge 0 multiplicity 1
48 atoms
O  3.343384 0.699482 -1.789582
O  1.599073 -1.912431 0.386019
O  2.76287 2.480224 0.758586
O  2.905886 -0.602906 2.451087
O  -1.851141 1.794939 0.073168
O  -3.248656 -1.130594 -1.074904
O  -3.899533 0.918999 0.767105
C  1.1652 0.87125 -0.379678
C  2.189187 -0.030425 -1.096144
C  -0.102043 -0.034577 -0.004422
C  2.676776 -0.984074 -0.021841
C  2.034497 1.221459 0.914317
C  2.394753 -0.201751 -2.555114
C  3.016921 0.009821 1.127819
C  0.360798 -1.218395 0.911668
C  0.784106 2.128692 -1.186664
C  -0.769217 -0.636111 -1.273997
C  -1.111753 0.765201 0.864016
C  -1.880727 -1.694813 -1.037683
C  -0.655787 -2.319877 1.070157
C  -1.673251 -2.561276 0.199406
C  -2.653301 -3.698776 0.387107
C  -3.243292 1.792863 0.143276
C  -3.837621 2.935215 -0.641705
H  3.51183 -1.632451 -0.328634
H  1.433137 1.372772 1.823867
H  2.854943 -1.122565 -2.934662
H  1.740721 0.329914 -3.257153
H  4.051737 0.380826 1.012542
H  0.625778 -0.808978 1.909858
H  0.380868 2.911148 -0.52684
H  1.670499 2.539941 -1.699171
H  0.020302 1.905735 -1.949848
H  0.024637 -1.133224 -1.859529
H  -1.202156 0.156459 -1.908247
H  -0.593988 1.339365 1.650729
H  -1.849194 0.095625 1.340106
H  -1.890847 -2.359012 -1.923455
H  -0.515365 -2.981956 1.934096
H  3.299616 2.431716 -0.075843
H  2.654094 -1.557143 2.325152
H  -2.488877 -4.230761 1.339464
H  -2.558786 -4.430862 -0.439279
H  -3.69384 -3.328171 0.35623
H  -3.474798 -0.672934 -0.217591
H  -4.276567 2.535609 -1.574076
H  -3.078029 3.68848 -0.894592
H  -4.655844 3.392326 -0.061824
