program: Gaussian 09
title: 000156308
version: EM64L-G09RevD.01
frameworkgroup: C1[X(C21H24NO4)]
method: RPBEPBE
basis: SDD
operation: Freq
keyword: #p
keyword: freq=noraman
keyword: PBEPBE/SDD
title: #p freq=noraman PBEPBE/SDD
converged: YES YES NO NO
title: Mulliken charges:
elementType: O O O O N C C C C C C C C C C C C C C C C C C C C C H H H H H H H H H H H H H H H H H H H H H H H H
charge: -0.314691 -0.248651 -0.244015 -0.292040 -0.107687 -0.162328 -0.397358 -0.486616 -0.598286 0.270479 -0.578694 -0.611718 0.090603 0.292188 0.382895 -0.453840 0.050171 -0.488489 -0.405191 0.146448 0.174571 0.200920 -0.357903 -0.202082 -0.524729 -0.527917 0.301442 0.282559 0.274726 0.305892 0.274711 0.257936 0.260530 0.270209 0.258339 0.261110 0.286403 0.295156 0.259183 0.274600 0.254958 0.272817 0.259489 0.260397 0.227937 0.277559 0.245065 0.253582 0.234876 0.244481
chargesum: 1.00000
title: Mulliken charges with hydrogens summed into heavy atoms:
elementType: O O O O N C C C C C C C C C C C C C C C C C C C C C
charge: -0.314691 -0.248651 -0.244015 -0.292040 -0.107687 0.139115 0.159926 0.093987 -0.079819 0.270479 -0.050146 0.230951 0.090603 0.292188 0.382895 -0.194656 0.050171 -0.213889 -0.150233 0.146448 0.174571 0.200920 -0.085086 0.317804 0.225832 0.205023
polarizability: 3.58242169e+02 1.68215721e+01 2.40136898e+02 -8.38630489e-01 -1.46757192e-01 1.40318235e+02
1716.lowfreq: -10.6173 -6.2987 -1.7426 -0.0007 0.0005 0.0006 23.8229 43.7787 57.4973
frequency: 23.6901 43.7688 57.4940 63.0718 74.2828 85.5110 108.9650 110.8355 123.8269 143.5936 145.6654 156.1459 176.3820 208.0901 219.4983 234.4148 252.1986 253.6076 265.3383 285.4529 297.1549 310.7613 320.5316 355.6452 364.4899 379.6654 397.4245 409.0507 432.0304 441.6751 461.3532 501.2888 517.1933 539.5657 552.4353 556.9257 586.4041 608.2182 636.9556 666.4881 677.2641 681.2221 699.5057 714.0858 726.3561 734.4785 758.0288 785.0163 817.0274 827.5799 834.5174 844.9022 854.2000 863.7883 876.7883 896.2863 906.6837 927.6864 952.6537 955.5350 969.2597 971.2591 994.3197 1003.3574 1025.4925 1051.6113 1060.9013 1061.3346 1072.7065 1090.5414 1112.3081 1115.4621 1119.9953 1144.7851 1151.7809 1153.9951 1166.9983 1169.6526 1173.0527 1185.1454 1207.6052 1217.3658 1218.9585 1225.9963 1227.3768 1249.6649 1254.1125 1269.6148 1283.8589 1295.0238 1319.8842 1340.6865 1342.9806 1355.0269 1364.0842 1373.4454 1393.0491 1413.4845 1421.8136 1428.4359 1430.9204 1431.4854 1444.9440 1454.2277 1456.0067 1457.5309 1462.6182 1463.2888 1471.2833 1476.4889 1477.9479 1481.7669 1486.1571 1489.4682 1491.0585 1497.7368 1584.2377 1607.0943 1621.7780 1624.7270 2970.6746 2980.3367 2986.4765 2989.0636 2992.7414 3002.2904 3021.3154 3029.7668 3039.2792 3043.2712 3050.9093 3077.5242 3079.2825 3094.6312 3098.0749 3127.5651 3137.3085 3139.8147 3142.0466 3143.9890 3153.4742 3168.0380 3173.3433 3187.6933
redmass: 4.4339 4.0588 2.5572 3.2337 4.9992 4.2412 3.1501 3.1516 2.9088 1.2485 2.8094 1.2021 3.8873 2.7085 4.3121 3.4434 3.5947 2.2526 2.9257 1.9681 3.8485 3.3235 2.7151 4.4293 4.9408 3.7825 3.7705 3.9319 3.0512 3.5789 4.4204 4.2579 4.2820 3.3808 4.1035 4.4426 4.6358 4.1303 6.1499 4.5507 4.9460 8.9498 3.1648 4.0231 4.7676 5.3498 4.6633 6.0358 3.9401 8.6135 1.4884 2.8254 1.7720 2.1355 1.6786 4.6595 2.2597 3.5893 1.9679 2.6351 4.5707 1.7025 3.1183 2.7497 2.7296 3.5019 2.8865 1.4491 2.7570 2.0994 1.2360 1.2292 1.0366 1.3723 1.3750 1.6285 1.6863 1.7324 1.7854 1.7823 2.3999 1.7289 1.2161 1.4674 1.4589 1.5015 2.0557 4.4089 1.4494 1.4970 1.4777 1.7544 1.6835 1.5807 1.3273 3.1732 1.4551 2.2046 4.4347 1.4738 1.6452 1.7310 1.4788 1.0900 1.1160 1.0868 1.0707 1.0878 1.0823 1.3797 1.1250 1.1216 1.8858 1.0664 2.1203 1.1154 8.0519 6.9624 9.6162 7.5975 1.0825 1.0307 1.0650 1.0658 1.0318 1.0633 1.0618 1.0331 1.0538 1.0937 1.0966 1.1055 1.1012 1.1074 1.1027 1.1200 1.1024 1.0901 1.1043 1.1051 1.1051 1.0934 1.0958 1.0920
irintensity: 0.0645 0.5020 4.3788 13.7184 4.3028 0.6573 1.1414 1.8758 6.8112 1.5222 1.8389 0.1930 0.3103 1.0203 14.1112 8.5383 1.8195 0.6543 1.3032 2.2423 9.4083 3.5585 4.9854 2.5110 1.2912 0.4435 3.7018 2.2249 13.7267 1.6452 7.3816 0.8297 1.0896 0.2824 0.5116 0.6042 9.3378 8.3670 1.8226 0.8850 4.6744 1.4189 1.4653 2.0652 7.1495 7.1701 13.7567 2.1315 22.6643 23.7796 21.2154 9.2271 18.1755 4.7057 32.9739 49.9579 5.9885 64.3673 24.4395 63.8258 150.1642 12.4604 5.5628 41.7453 13.1401 39.4108 11.9029 4.4818 18.6641 2.5617 8.0032 8.9032 0.0010 2.0321 0.3285 11.2797 12.2482 4.4757 5.8703 16.8013 27.0452 10.4030 23.1235 15.8520 30.5732 46.4568 18.8878 355.3914 2.2585 8.8470 11.2272 36.5987 10.6474 4.5918 1.1963 27.5792 37.6030 16.3218 4.1822 20.6054 13.3711 2.9316 50.9115 1.4137 40.1882 32.1873 12.2112 24.9579 29.8144 88.0422 17.7912 2.8331 43.8198 43.8578 126.2816 41.3794 12.1067 4.2273 0.2879 8.1290 4.1871 50.9609 18.0747 24.9806 54.0549 11.8247 11.3738 4.7133 82.0149 7.7834 4.8697 26.5628 1.3741 9.3619 19.4616 15.2884 15.0959 3.8765 1.6561 7.9434 0.4972 0.7492 1.1526 1.1814
temp: 298.150 k
press: 1.00000 atm
elementType: 8 8 8 8 7 6 6 6 6 6 6 6 6 6 6 6 6 6 6 6 6 6 6 6 6 6 1 1 1 1 1 1 1 1 1 1 1 1 1 1 1 1 1 1 1 1 1 1 1 1
symmnumber: 1
zpe: 1079251.7 jmol-1
zpe.correction: 0.411065 hartree
zpe.thermalcorrener: 0.434608 hartree
zpe.thermalcorrenthalpy: 0.435552 hartree
zpe.thermalcorrgfe: 0.358513 hartree
zpe.sumelectzpe: -1168.088374 hartree
zpe.sumelectthermal: -1168.064831 hartree
zpe.sumelectthermalent: -1168.063887 hartree
zpe.sumelectthermalfe: -1168.140926 hartree
dipole: -0.0399 4.0852 0.9843
dipole: 4.2023
quadrupole: -82.9377 -124.9565 -142.2197
quadrupole: 8.7987 3.0539 -2.6493
quadrupole: 33.7669 -8.2518 -25.5151 8.7987 3.0539 -2.6493
hfenergy: -1168.4994389 hartree
pointgroup: C01 [X(C21H24N1O4)]
dipole: -0.0450774 1.5992366 0.4169094 debye
polarizability: 357.3474268|19.5055754|240.9294777|-4.0774564|1.3224871|140.4203982 unknown
InChI: InChI=1S/C21H24NO4/c1-22-7-6-14-9-19-20(26-12-25-19)10-15(14)17(22)8-13-4-5-18(23-2)21(24-3)16(13)11-22/h4-5,9-10,17H,6-8,11-12H2,1-3H3
charge 1 multiplicity 1
50 atoms
O  4.244892 1.451267 -0.331128
O  -5.146874 -2.181084 -0.268653
O  -6.3135 -0.157521 0.30147
O  5.847853 -1.016054 -0.083951
N  0.065897 1.303771 0.222698
C  -0.641713 0.082775 -0.448019
C  -0.687384 2.577977 -0.199404
C  1.496519 1.407259 -0.327531
C  0.074807 -1.220404 -0.035576
C  -2.150521 0.096462 -0.17126
C  -2.105685 2.608237 0.367189
C  0.106576 1.179038 1.740813
C  2.257571 0.103287 -0.201551
C  -2.846402 1.293671 0.156917
C  1.594919 -1.143993 -0.100878
C  -2.868935 -1.130279 -0.333014
C  3.67589 0.167477 -0.229633
C  -4.259667 1.289008 0.345228
C  2.367857 -2.328398 -0.032338
C  -4.248895 -1.105483 -0.155231
C  -4.936445 0.083693 0.180494
C  4.441555 -1.025025 -0.093526
C  3.774482 -2.268657 -0.025819
C  -6.500101 -1.613071 0.015236
C  5.246404 1.658789 -1.415344
C  6.470277 -0.372298 1.103136
H  -0.454052 0.259152 -1.52788
H  -0.70298 2.568633 -1.30328
H  -0.085594 3.438385 0.140457
H  2.009572 2.216183 0.21888
H  1.402837 1.726074 -1.382905
H  -0.268141 -2.017005 -0.719318
H  -0.26028 -1.526483 0.97504
H  -2.644534 3.433085 -0.134966
H  -2.088559 2.873867 1.442403
H  0.398781 2.152877 2.163259
H  -0.885346 0.884697 2.110934
H  0.853499 0.421356 2.015359
H  -2.375151 -2.067471 -0.595894
H  -4.796532 2.205826 0.604232
H  1.867671 -3.300981 0.030769
H  4.383471 -3.174912 0.043483
H  -6.914587 -2.103397 0.910325
H  -7.131419 -1.723854 -0.880703
H  4.749361 1.582004 -2.399442
H  6.058396 0.917046 -1.348559
H  5.628841 2.677623 -1.259502
H  7.55342 -0.419162 0.921183
H  6.216319 -0.942216 2.015288
H  6.141028 0.677629 1.207813
