program: Gaussian 09
title: 000156305
version: EM64L-G09RevD.01
frameworkgroup: C1[X(C19H35NO)]
method: RPBEPBE
basis: SDD
operation: Freq
keyword: #p
keyword: freq=noraman
keyword: PBEPBE/SDD
title: #p freq=noraman PBEPBE/SDD
converged: YES YES NO NO
title: Mulliken charges:
elementType: O N C C C C C C C C C C C C C C C C C C C H H H H H H H H H H H H H H H H H H H H H H H H H H H H H H H H H H H
charge: -0.467268 -0.355423 0.319949 -0.086599 -0.503701 -0.502922 -0.132772 -0.075117 -0.376127 -0.477984 -0.440617 -0.449166 -0.407598 -0.459648 -0.378246 -0.370422 -0.360406 -0.452969 -0.700533 -0.033405 -0.600595 0.211620 0.205979 0.219000 0.213572 0.247194 0.197807 0.209842 0.199984 0.210853 0.192458 0.199990 0.203095 0.202725 0.205407 0.165191 0.247211 0.185905 0.193990 0.196861 0.188358 0.188214 0.195774 0.334345 0.186719 0.246127 0.199820 0.193092 0.202809 0.192906 0.209065 0.210576 0.215649 0.211269 0.212061 0.216105
chargesum: 0.00000
title: Mulliken charges with hydrogens summed into heavy atoms:
elementType: O N C C C C C C C C C C C C C C C C C C C
charge: -0.132924 -0.145581 0.319949 0.125021 -0.078722 -0.042156 0.065034 0.124867 0.027184 -0.074898 -0.032486 -0.036765 -0.027703 -0.074430 0.005741 0.062424 0.032506 -0.057254 -0.065243 0.177865 -0.172429
polarizability: 2.19778947e+02 -7.16937804e+00 2.23693638e+02 1.13787779e+00 6.05449604e+00 1.90302811e+02
1716.lowfreq: -9.6735 -4.4078 -0.0007 -0.0005 0.0005 11.8330 15.5057 29.6581 35.4048
frequency: 15.4559 29.2809 35.2608 43.3441 58.2109 63.9507 87.5213 94.6914 102.1634 116.5664 120.4744 135.8595 163.9967 189.2138 209.4201 219.8124 226.7202 251.6717 256.0910 271.7724 281.9645 283.5891 297.3498 319.8771 349.7989 393.3556 406.7613 413.5881 428.5485 450.6709 470.4936 477.3533 508.4102 526.0429 564.9326 600.9046 635.1955 664.1190 691.3392 718.6608 727.9555 740.5750 768.5061 798.8081 823.6548 830.1860 856.4193 869.2074 873.4541 890.0214 895.5306 906.9351 910.4419 924.4686 936.5270 941.7845 950.0117 980.1748 989.6267 1007.3808 1009.2722 1017.8791 1019.4439 1039.3149 1042.4377 1061.1052 1061.3409 1067.2364 1072.7194 1078.0110 1091.5095 1102.2888 1107.1576 1113.5886 1116.7170 1143.0646 1150.1914 1169.1197 1176.8989 1191.1570 1194.1525 1206.0837 1218.3167 1235.1092 1237.4396 1246.5105 1259.9865 1267.6694 1270.8636 1274.8798 1278.9879 1288.4452 1289.7219 1294.4087 1303.9550 1305.2408 1317.4885 1324.0553 1329.8000 1336.2309 1337.2770 1339.9515 1344.1729 1345.4999 1349.2830 1351.0329 1351.7046 1363.2731 1384.7146 1387.5032 1424.7605 1434.5784 1449.3759 1457.8578 1458.3753 1459.1283 1461.2695 1464.9873 1467.8477 1471.4181 1475.5507 1476.2261 1478.7022 1482.6344 1484.3704 1486.7610 1657.5622 2935.4847 2940.3046 2946.8053 2948.4877 2949.1714 2953.9694 2960.7546 2965.9825 2967.1653 2968.1949 2970.4505 2970.7618 2972.0281 2978.9250 2986.8623 2988.9651 2996.6943 3002.6358 3014.5676 3015.1122 3017.2429 3021.3280 3028.0133 3037.3307 3045.4222 3047.7628 3056.4495 3060.1530 3066.9099 3069.7246 3070.3750 3088.6062 3191.8463 3380.1473 3556.1687
redmass: 3.5073 2.4840 3.4951 2.0701 2.3484 2.5613 3.1741 2.8835 2.6956 2.6385 3.0008 2.6399 2.5018 2.8617 3.0067 1.2186 2.7141 3.8180 2.7523 2.8248 1.1655 2.4201 2.2449 2.4421 2.2462 2.7168 2.6386 2.3196 2.1805 2.3210 2.6129 2.1721 3.1732 2.5126 2.6280 2.6519 1.5254 2.1369 2.8566 1.9859 1.1817 1.1290 1.6507 1.6707 1.3666 1.7581 1.9793 2.2936 1.7800 2.1427 2.1204 1.6752 1.8846 1.7838 1.3509 1.8863 1.9822 1.9750 1.4674 1.3075 2.6901 3.0998 2.0289 1.8990 2.0375 1.8987 1.8082 1.8014 2.3590 2.0541 2.2271 2.0599 2.0548 2.1362 2.0204 2.1305 1.3535 1.6572 1.6497 1.6470 1.5848 1.5166 1.3889 1.3842 1.4292 1.2552 1.2427 1.4169 1.1638 1.2428 1.3309 1.0935 1.2099 1.2401 1.2321 1.3740 1.3787 1.3880 1.3884 1.2857 1.4757 1.5406 1.4531 1.4825 1.5198 1.5069 1.5304 1.4384 1.5457 1.2162 1.1784 1.1640 1.0928 1.0938 1.0934 1.0853 1.0770 1.0768 1.0923 1.0896 1.0430 1.0811 1.0945 1.0993 1.0858 1.0866 4.7454 1.0803 1.0628 1.0624 1.0622 1.0755 1.0618 1.0640 1.0653 1.0718 1.0638 1.0649 1.0371 1.0693 1.0638 1.0652 1.0642 1.0958 1.0949 1.0934 1.0992 1.0974 1.1003 1.0998 1.0976 1.0997 1.1018 1.0989 1.0973 1.1007 1.0797 1.0993 1.0740 1.1144 1.0721 1.0660
irintensity: 0.0040 0.0503 0.0741 0.0568 0.0502 0.1375 0.1828 1.0155 0.4136 1.0188 0.3690 2.8600 1.7182 0.3089 0.2820 0.1363 0.4316 0.9567 4.7700 11.3874 104.3422 16.3412 0.6502 2.2136 3.2187 0.0846 3.5731 4.3017 1.1278 0.9781 6.1221 0.8858 3.6346 9.8753 4.4435 0.9622 19.5284 36.1324 1.1896 27.9741 14.7968 10.5711 0.4780 4.5996 1.3211 2.5376 14.3456 17.4254 9.1249 14.3937 9.7056 21.2056 3.1186 0.7166 88.4557 0.7582 2.3485 15.8244 4.4809 14.6978 2.6519 3.1108 11.6272 4.1765 7.8447 11.1756 6.5387 1.1237 2.4803 3.8364 1.8212 21.1348 7.8086 2.4122 2.0002 13.5151 20.2271 10.8910 2.2821 10.8051 17.8974 18.6021 13.0190 1.7695 6.3790 4.4670 3.5195 2.3573 3.4643 1.3884 2.2776 0.2958 0.1502 0.7438 2.5844 2.5326 1.7027 9.2235 0.7031 3.2689 1.7350 11.1911 0.8818 1.8850 1.3143 0.7062 2.5216 3.4458 5.6117 11.8541 3.6040 34.0253 1.7968 3.1360 4.1965 13.3368 6.2998 2.8872 12.6904 6.3906 11.2336 7.3058 8.5768 15.6165 8.4708 13.1679 21.9464 34.9697 7.0113 23.8294 49.8927 8.0943 9.3958 11.4633 22.0886 30.3322 154.0312 35.5088 37.3882 56.8253 31.3691 21.5286 26.6244 10.8676 8.5393 32.2125 50.5155 53.7145 16.0879 49.5964 78.7538 31.3909 54.7567 44.4796 38.4403 90.5730 50.9498 52.9953 7.7684 34.2161 5.8944 2.4663
temp: 298.150 k
press: 1.00000 atm
elementType: 8 7 6 6 6 6 6 6 6 6 6 6 6 6 6 6 6 6 6 6 6 1 1 1 1 1 1 1 1 1 1 1 1 1 1 1 1 1 1 1 1 1 1 1 1 1 1 1 1 1 1 1 1 1 1 1
symmnumber: 1
zpe: 1327391.5 jmol-1
zpe.correction: 0.505577 hartree
zpe.thermalcorrener: 0.529490 hartree
zpe.thermalcorrenthalpy: 0.530434 hartree
zpe.thermalcorrgfe: 0.450614 hartree
zpe.sumelectzpe: -873.254518 hartree
zpe.sumelectthermal: -873.230605 hartree
zpe.sumelectthermalent: -873.229661 hartree
zpe.sumelectthermalfe: -873.309481 hartree
dipole: 1.5689 -0.6430 0.5631
dipole: 1.7867
quadrupole: -131.2074 -131.3775 -130.6617
quadrupole: 1.9898 7.5166 -2.7414
quadrupole: -0.1252 -0.2953 0.4205 1.9898 7.5166 -2.7414
hfenergy: -873.7600946 hartree
pointgroup: C01 [X(C19H35N1O1)]
dipole: -0.6055214 0.2723646 0.2307925 debye
polarizability: 219.0925244|-6.8220062|224.9185215|-1.560563|-4.3103413|189.7643504 unknown
InChI: InChI=1S/C19H35NO/c1-3-5-7-10-16-11-8-14-19(20-16)15-9-13-18(21)17(19)12-6-4-2/h3,16-18,20-21H,1,4-15H2,2H3
charge 0 multiplicity 1
56 atoms
O  -3.863046 1.032209 0.184213
N  0.617321 0.445448 -0.206898
C  -0.718293 1.093074 0.070337
C  -1.689412 -0.075096 0.489856
C  -0.514919 2.037785 1.296217
C  -1.220966 1.872636 -1.187424
C  -2.981854 0.400508 1.201829
C  1.668923 1.339954 -0.776318
C  -1.831223 2.556951 1.909956
C  -2.706313 1.372972 2.364794
C  -0.152361 2.838257 -1.756421
C  -2.043911 -1.067844 -0.655064
C  1.178935 2.102866 -2.038075
C  2.940023 0.508801 -1.0635
C  -2.533573 -2.447373 -0.154547
C  3.59211 -0.092417 0.2005
C  -2.796721 -3.445721 -1.305136
C  4.80675 -1.000104 -0.130468
C  -3.305975 -4.815424 -0.806224
C  5.504887 -1.521355 1.107698
C  5.708151 -2.82878 1.40972
H  -1.118676 -0.640206 1.260346
H  0.123665 2.895959 1.017174
H  0.047337 1.459559 2.057157
H  -1.478935 1.136608 -1.974268
H  -2.157083 2.40907 -0.954458
H  -3.502345 -0.49597 1.604441
H  0.489079 -0.356488 -0.846159
H  1.920988 2.090393 0.001451
H  -2.386972 3.166575 1.171793
H  -1.606801 3.21665 2.770194
H  -2.183312 0.817302 3.170099
H  -3.666855 1.727283 2.793463
H  0.030062 3.671968 -1.04824
H  -0.535075 3.301485 -2.686726
H  -1.16012 -1.240455 -1.304192
H  -2.82249 -0.614738 -1.296382
H  1.033438 1.373539 -2.864043
H  1.955979 2.820448 -2.37116
H  3.672512 1.154065 -1.590904
H  2.68127 -0.308428 -1.772871
H  -1.780493 -2.879359 0.538161
H  -3.467785 -2.329752 0.431078
H  -4.705594 1.299058 0.631827
H  3.920626 0.731558 0.867918
H  2.831818 -0.665192 0.762077
H  -3.535818 -3.006072 -2.005524
H  -1.862516 -3.585645 -1.886889
H  4.477124 -1.849279 -0.76104
H  5.528969 -0.4128 -0.738753
H  -4.252819 -4.703735 -0.244343
H  -2.569804 -5.289305 -0.129491
H  -3.491024 -5.511289 -1.645208
H  5.861959 -0.75103 1.811123
H  6.219032 -3.135788 2.329606
H  5.365825 -3.630737 0.743201
