program: Gaussian 09
title: 000156293
version: EM64L-G09RevD.01
frameworkgroup: C1[X(C21H22O10)]
method: RPBEPBE
basis: SDD
operation: Freq
keyword: #p
keyword: freq=noraman
keyword: PBEPBE/SDD
title: #p freq=noraman PBEPBE/SDD
converged: YES YES NO NO
title: Mulliken charges:
elementType: O O O O O O O O O O C C C C C C C C C C C C C C C C C C C C C H H H H H H H H H H H H H H H H H H H H H H
charge: -0.401778 -0.452992 -0.458141 -0.455865 -0.473985 -0.475682 -0.293749 -0.389373 -0.364992 -0.457270 0.019665 -0.623777 -0.170771 -0.195419 -0.087627 0.025374 0.387790 0.454805 -0.007486 0.000584 -0.393614 -0.091150 0.020691 -0.496720 0.082030 0.375661 0.167343 -0.537558 -0.227086 -0.421338 -0.494532 0.276655 0.284060 0.233143 0.239041 0.222615 0.247228 0.195913 0.266000 0.368517 0.278073 0.370790 0.369770 0.271754 0.242462 0.231200 0.379540 0.218221 0.218550 0.407931 0.385370 0.363194 0.366936
chargesum: 0.00000
title: Mulliken charges with hydrogens summed into heavy atoms:
elementType: O O O O O O O O O O C C C C C C C C C C C C C C C C C C C C C
charge: -0.401778 -0.084475 -0.087351 -0.086095 -0.094445 -0.067751 -0.293749 -0.004003 -0.001798 -0.090334 0.296320 -0.339717 0.062371 0.043622 0.134987 0.272602 0.387790 0.454805 -0.007486 0.000584 0.068299 -0.091150 0.020691 -0.218647 0.082030 0.375661 0.167343 -0.265805 0.015376 -0.190137 -0.057761
polarizability: 3.46367618e+02 -4.14890620e+01 3.05983260e+02 -1.88296514e+01 -3.42949561e+01 1.84772757e+02
1716.lowfreq: -0.0002 0.0003 0.0005 5.0699 7.2350 7.9020 33.6384 38.9295 43.9989
frequency: 33.6316 38.9068 43.9920 57.5859 75.5124 85.6514 97.5072 99.5120 112.4838 142.1921 156.6059 160.8162 181.8198 197.7992 204.7691 216.2706 222.8460 231.3412 237.2051 260.6136 262.1597 281.7837 293.3179 308.3481 318.6266 326.4656 335.5187 352.0198 378.2530 406.0906 407.6257 417.4582 426.7702 430.1052 436.1455 436.6154 445.6187 462.1489 469.5809 469.9446 487.0809 493.8035 501.7028 513.2939 547.6092 561.5228 569.7177 573.8234 591.3701 600.7674 612.0093 631.6894 652.6171 658.1623 679.6691 685.5142 710.6771 749.3234 762.0028 780.6287 801.2772 834.1954 860.7378 864.2343 876.0310 878.3061 894.5726 934.6597 937.7501 942.1024 954.8217 966.9115 968.7141 974.1120 984.4348 1001.7902 1017.2998 1023.2077 1031.4560 1036.6966 1041.6213 1055.5491 1063.7019 1069.7737 1097.4004 1108.3410 1117.7483 1153.5191 1167.3280 1176.5146 1180.6371 1185.6298 1199.4928 1206.0642 1207.7379 1216.2422 1228.8210 1230.5860 1252.8847 1260.9454 1275.8326 1281.7143 1295.2261 1305.8688 1310.4124 1312.3253 1317.1442 1333.4081 1345.5361 1353.4934 1354.7232 1358.6460 1368.8827 1372.6413 1381.6472 1387.3864 1394.1671 1396.7239 1409.2686 1428.5898 1449.7368 1458.8143 1460.7815 1468.8972 1477.8648 1496.4119 1549.0006 1578.2025 1594.5603 1598.7427 1632.8514 2757.3928 2956.2471 2967.4511 2972.8071 2975.1094 2983.4140 2994.0939 3005.1792 3006.0464 3047.1481 3084.8063 3104.1969 3120.9488 3132.8754 3164.0141 3166.6334 3313.0254 3408.6100 3513.5469 3533.4840 3549.1816 3555.2146
redmass: 6.5305 7.3389 6.6549 6.8652 6.3329 7.2578 7.5438 6.7949 6.0911 7.3471 4.3586 7.3090 6.5209 5.1443 4.2324 5.5119 4.1630 5.3968 5.0115 4.9087 5.0375 5.7145 5.1206 5.2562 3.2593 6.2599 6.5531 3.7567 5.3900 7.6240 6.5000 2.0611 2.0359 2.4585 1.5916 2.0856 1.3856 4.1365 4.7152 1.3853 3.4034 3.6202 1.4562 3.7755 3.8885 4.9808 4.1404 4.7686 5.1514 4.3696 2.5430 2.1966 2.4497 4.3825 5.4648 4.6957 4.4756 5.9047 5.0891 1.9507 4.0666 3.7053 2.1574 1.6813 1.3981 1.9819 3.0988 1.1018 4.7062 6.1764 5.9976 1.5087 2.0901 4.6314 5.3840 3.0981 3.1434 3.7465 5.7250 3.1806 2.8716 2.6367 2.6530 3.4004 2.8484 3.3708 2.6918 1.8025 1.2811 1.2820 1.2059 1.5362 1.5535 1.2707 1.3730 1.1916 1.6033 1.1627 1.2911 2.3824 1.3158 2.1985 1.3126 1.2487 1.2657 2.5994 3.0369 1.3333 1.2710 1.3602 2.2651 1.8692 1.2894 1.2988 2.7922 1.4100 2.8275 2.1020 4.0863 1.9247 2.6859 1.0901 1.9861 1.1519 2.6835 1.6779 2.5660 4.4700 6.3433 6.2289 5.4135 1.0706 1.0814 1.0838 1.0813 1.0704 1.0840 1.0863 1.0830 1.0638 1.0667 1.1020 1.0956 1.0891 1.0900 1.0985 1.0924 1.0686 1.0684 1.0659 1.0657 1.0657 1.0653
irintensity: 0.0501 0.4753 0.1808 1.0383 1.1283 1.6830 1.0640 5.2155 0.2902 1.9076 1.3076 9.2266 0.9409 6.8876 3.4404 4.2512 4.4289 1.9956 2.6607 13.6834 2.1039 4.3520 3.5241 0.9174 6.5418 10.5265 5.6195 4.8432 19.8830 26.2524 13.2592 67.4447 42.7342 10.0791 101.5088 43.4959 64.4245 3.3213 33.9866 155.5950 35.5110 9.9537 16.4899 11.0692 3.3960 13.3754 24.6206 11.0078 12.7689 16.4074 89.8573 132.5482 167.1959 63.2717 7.0112 39.2635 21.8930 4.4362 25.3133 47.4860 11.6934 62.7573 64.3630 149.2174 21.4489 53.2577 47.4014 82.8862 36.0753 68.4932 11.0490 19.3168 74.7252 22.0477 89.8380 10.2918 64.0630 83.4391 67.3234 133.9475 58.9028 76.4365 7.8152 6.6382 4.1619 31.7088 12.0230 68.1909 21.2066 37.4479 37.5129 32.0979 15.7913 13.3050 58.7180 30.0104 19.2928 27.5478 17.6942 130.7554 24.7451 74.1597 48.2296 53.1548 10.5959 10.7124 119.3597 3.2830 34.1224 64.7916 115.6754 72.9432 18.2471 17.6997 42.0871 3.7616 78.9304 21.9552 83.6416 20.3021 42.4574 9.3891 185.8011 10.0671 26.6090 62.2900 20.0672 83.8907 80.6815 69.3691 106.9752 183.2522 2.7506 17.0952 0.7099 37.7914 1.6517 34.6512 43.4797 77.6856 467.0822 22.3440 11.8061 9.5437 8.3774 13.5590 1.5732 338.0775 247.9571 108.0877 37.7131 23.4139 22.8625
temp: 298.150 k
press: 1.00000 atm
elementType: 8 8 8 8 8 8 8 8 8 8 6 6 6 6 6 6 6 6 6 6 6 6 6 6 6 6 6 6 6 6 6 1 1 1 1 1 1 1 1 1 1 1 1 1 1 1 1 1 1 1 1 1 1
symmnumber: 1
zpe: 1064373.9 jmol-1
zpe.correction: 0.405399 hartree
zpe.thermalcorrener: 0.432895 hartree
zpe.thermalcorrenthalpy: 0.433839 hartree
zpe.thermalcorrgfe: 0.349851 hartree
zpe.sumelectzpe: -1563.360516 hartree
zpe.sumelectthermal: -1563.333019 hartree
zpe.sumelectthermalent: -1563.332075 hartree
zpe.sumelectthermalfe: -1563.416063 hartree
dipole: 5.4459 -8.6301 4.3785
dipole: 11.1044
quadrupole: -172.7611 -190.7649 -184.9660
quadrupole: -7.4462 4.0659 3.0804
quadrupole: 10.0696 -7.9343 -2.1353 -7.4462 4.0659 3.0804
hfenergy: -1563.7659143 hartree
pointgroup: C01 [X(C21H22O10)]
dipole: 2.9650476 -3.1801801 -0.4258676 debye
polarizability: 298.4364101|-20.9157988|355.569655|-3.9427896|-46.4176195|183.1175697 unknown
InChI: InChI=1S/C21H22O10/c22-5-7-4-10(25)14-15(16(7)26)13(8-2-1-3-9(24)12(8)18(14)28)21-20(30)19(29)17(27)11(6-23)31-21/h1-4,11,13,17,19-27,29-30H,5-6H2
charge 0 multiplicity 1
53 atoms
O  1.462857 1.470679 -0.472567
O  2.44441 -1.410034 1.718933
O  4.472979 0.530692 2.12461
O  3.583454 3.266925 1.954845
O  0.50456 4.18423 -0.992265
O  -0.245595 1.824088 -2.313581
O  -2.911194 -2.356524 1.28941
O  -4.428906 -0.440017 0.68176
O  -1.716308 -4.726611 1.226264
O  -2.427603 4.326771 -1.028668
C  1.160681 0.214209 0.257538
C  0.347536 -0.633981 -0.793561
C  2.529178 -0.267643 0.801605
C  3.112201 0.85718 1.691465
C  3.209392 2.2288 0.99843
C  1.838827 2.606566 0.408127
C  -1.047255 -0.012394 -0.879805
C  0.341779 -2.122612 -0.4646
C  -2.108858 -0.601557 -0.125145
C  -0.749535 -2.720437 0.235916
C  1.831388 3.880648 -0.446861
C  -1.272054 1.209099 -1.549658
C  -1.961912 -1.908696 0.530236
C  1.45924 -2.899011 -0.85775
C  -3.381472 0.072715 -0.045576
C  -2.525183 1.890457 -1.457255
C  -0.663321 -4.116813 0.556149
C  -3.565393 1.304924 -0.71704
C  1.523433 -4.273709 -0.53712
C  0.473436 -4.876665 0.177551
C  -2.691523 3.288016 -2.040754
H  0.492684 0.436249 1.117003
H  0.881105 -0.510445 -1.757827
H  3.217761 -0.47746 -0.044008
H  2.445324 0.951062 2.577333
H  3.96078 2.154362 0.181983
H  1.079769 2.697595 1.211507
H  2.579693 3.792334 -1.262149
H  2.109921 4.729995 0.195957
H  2.230278 -2.230112 1.202176
H  2.261284 -2.436708 -1.443514
H  4.435124 -0.350107 2.579401
H  4.385756 2.945999 2.44279
H  -4.524772 1.818891 -0.606928
H  2.384272 -4.872788 -0.850616
H  0.520455 -5.943509 0.430923
H  0.261947 3.512008 -1.696715
H  -2.048756 3.418197 -2.931718
H  -3.742269 3.45222 -2.329046
H  0.625582 1.608432 -1.831889
H  -4.082628 -1.30965 1.127578
H  -1.537489 -5.695497 1.346068
H  -1.452863 4.375337 -0.813041
