program: Gaussian 09
title: 000014077
version: EM64L-G09RevD.01
frameworkgroup: C1[X(C5H8N2)]
method: RPBEPBE
basis: SDD
operation: Freq
keyword: #p
keyword: freq=noraman
keyword: PBEPBE/SDD
title: #p freq=noraman PBEPBE/SDD
converged: YES YES NO NO
title: Mulliken charges:
elementType: N N C C C C C H H H H H H H H
charge: -0.096357 -0.018700 -0.407738 -0.419587 -0.384702 -0.426288 -0.147783 0.246982 0.219854 0.219082 0.246276 0.251718 0.193277 0.253091 0.270875
chargesum: 0.00000
title: Mulliken charges with hydrogens summed into heavy atoms:
elementType: N N C C C C C
charge: -0.096357 -0.018700 0.059099 0.045771 0.060293 0.097678 -0.147783
polarizability: 8.51647001e+01 3.47983289e+00 5.46987591e+01 -3.29081106e+00 -2.21932978e-01 4.75978968e+01
1716.lowfreq: -25.1204 -7.9463 -0.0008 -0.0008 -0.0007 4.1389 69.9749 104.3462 126.0017
frequency: 69.9601 104.3228 125.9825 249.1954 341.1517 380.4538 416.5465 506.7449 717.8979 783.1137 807.7161 817.1871 940.4700 977.0830 990.5883 1049.5097 1058.4647 1067.5334 1085.2326 1124.3130 1142.6169 1200.0870 1260.6904 1278.4839 1285.1850 1362.3621 1446.8083 1453.2554 1465.9932 1480.8793 2200.9414 2901.8102 3004.2355 3046.1993 3053.6468 3065.3403 3069.5153 3169.6876 3186.8439
redmass: 3.8967 2.7694 3.8113 3.7460 2.6272 3.6179 3.2104 5.7899 3.1823 1.3393 1.3792 2.9883 3.0219 1.3485 1.9686 2.9131 1.6434 1.3306 1.3191 1.6942 1.4330 1.2741 2.8198 1.3062 1.2655 1.3340 1.0786 1.0831 1.1437 1.1108 12.4302 1.0695 1.0594 1.0916 1.0523 1.0621 1.1003 1.1139 1.1150
irintensity: 6.2787 2.4506 8.6305 1.0522 2.2634 1.1723 4.4727 7.9161 12.1630 4.6928 1.5742 5.0560 4.2609 7.2850 23.5330 11.2455 2.4801 4.0058 12.7936 2.7736 0.3375 0.7758 19.5493 16.1739 1.7547 21.9670 8.0154 10.0750 0.6061 9.8554 14.9289 65.6481 5.8623 8.4881 27.1646 30.2917 17.8579 1.6635 36.3907
temp: 298.150 k
press: 1.00000 atm
elementType: 7 7 6 6 6 6 6 1 1 1 1 1 1 1 1
symmnumber: 1
zpe: 321125.8 jmol-1
zpe.correction: 0.122310 hartree
zpe.thermalcorrener: 0.129757 hartree
zpe.thermalcorrenthalpy: 0.130702 hartree
zpe.thermalcorrgfe: 0.090244 hartree
zpe.sumelectzpe: -304.215157 hartree
zpe.sumelectthermal: -304.207710 hartree
zpe.sumelectthermalent: -304.206766 hartree
zpe.sumelectthermalfe: -304.247224 hartree
dipole: 4.1114 0.5991 0.5548
dipole: 4.1917
quadrupole: -57.4882 -39.7942 -43.1137
quadrupole: -2.9153 4.6759 0.3533
quadrupole: -10.6895 7.0045 3.6850 -2.9153 4.6759 0.3533
hfenergy: -304.3374677 hartree
pointgroup: C01 [X(C5H8N2)]
dipole: -1.618954 -0.1460774 0.2779939 debye
dipolederiv: -0.7948414 -0.0597433 0.1365546 -0.0196268 -0.1155859 -0.0966205 0.190364 -0.0923698 -0.3628314 -0.3642545 0.0192225 -0.0003538 -0.065739 -0.2295765 0.0008835 -0.030169 0.0041266 -0.2386779 0.1715708 0.0103272 0.0500296 0.0373734 0.0059206 0.052233 0.0103094 0.0758855 0.1825811 0.1462545 0.093992 -0.0052 0.0800614 0.058652 0.1114009 -0.0088156 0.0961121 0.1172522 0.6240875 0.0455088 -0.0116742 -0.055859 0.1734755 0.0014468 0.0136683 0.0359434 0.2920417 -0.1260396 0.0025064 -0.0109726 0.0130114 0.1219691 -0.0191509 -0.0698584 -0.0447898 0.1921261 0.2205617 0.0762021 0.0623183 0.1863067 -0.0537394 0.0117186 0.0780818 0.0144093 -0.0396174 -0.0748887 0.0548352 -0.0855025 0.0585243 0.0570883 -0.0072605 -0.1090114 0.0120144 0.0371319 0.0336216 -0.0236139 -0.0590455 0.0329118 -0.0683678 -0.1010404 0.0118625 -0.1339811 0.0205886 0.0459862 -0.0350576 -0.1053739 -0.0365584 0.0633127 -0.0081714 -0.0435295 0.0498383 -0.1231566 0.044517 -0.0899501 -0.0150357 -0.1275334 -0.0634748 0.0185998 -0.0152556 -0.0102379 0.0602868 -0.0036732 -0.0290609 0.0346373 -0.0508071 -0.0541233 0.0861068 0.0284063 0.0986237 0.0165678 -0.0617552 0.0004567 0.0192828 -0.0225536 0.0050126 -0.0784947 -0.0889247 -0.13815 -0.1801025 0.0589347 -0.0501466 0.0005639 -0.0264207 0.0035479 0.0684404 0.0087125 0.0971067 0.0448707 0.0799188 -0.0154786 -0.0102281 -0.0030909 0.095889 -0.0400913 0.0241593 -0.0645315 -0.0190612 unknown
polarizability: 85.439197|3.0676797|54.350117|2.0911076|-1.1256233|47.672042 unknown
InChI: InChI=1S/C5H8N2/c6-2-1-3-7-4-5-7/h1,3-5H2
charge 0 multiplicity 1
15 atoms
N  -1.449811 -0.026723 -0.522728
N  3.397913 0.216445 0.247377
C  -2.647029 0.718049 0.012053
C  -2.26184 -0.631381 0.600824
C  -0.123245 0.521746 -0.140802
C  0.926768 -0.607264 -0.312535
C  2.29393 -0.161357 -0.002856
H  -3.493248 0.798292 -0.676292
H  -2.470126 1.604228 0.637472
H  -1.828842 -0.62944 1.611614
H  -2.828791 -1.529394 0.338685
H  0.113939 1.355258 -0.825912
H  -0.086028 0.913565 0.903824
H  0.666961 -1.461822 0.340754
H  0.884851 -0.972602 -1.355177
