program: Gaussian 09
title: 000156286
version: EM64L-G09RevD.01
frameworkgroup: C1[X(C21H26O3)]
method: RPBEPBE
basis: SDD
operation: Freq
keyword: #pfreq=noraman
keyword: PBEPBE/SDD
title: #p freq=noraman PBEPBE/SDD
converged: YES YES NO NO
title: Mulliken charges:
elementType: O O O C C C C C C C C C C C C C C C C C C C C C H H H H H H H H H H H H H H H H H H H H H H H H H H
charge: -0.226625 -0.289461 -0.216902 0.225238 -0.161594 -0.520900 -0.528670 0.363124 0.198598 -0.535966 -0.536900 0.119433 -0.807275 0.020982 -0.449561 -0.464362 -0.102383 0.115367 0.467488 -0.464973 -0.235183 -0.701625 -0.701468 -0.517560 0.239799 0.230266 0.218802 0.210160 0.239165 0.246178 0.244040 0.210353 0.263952 0.226015 0.239828 0.235832 0.240496 0.240724 0.222509 0.233156 0.242624 0.208742 0.212751 0.232375 0.215318 0.215770 0.214105 0.221259 0.210956 0.236002
chargesum: 0.00000
title: Mulliken charges with hydrogens summed into heavy atoms:
elementType: O O O C C C C C C C C C C C C C C C C C C C C C
charge: -0.226625 -0.289461 -0.216902 0.225238 0.078204 -0.071831 -0.079345 0.363124 0.198598 -0.045748 -0.062595 0.119433 -0.105601 0.020982 0.031659 -0.241853 -0.102383 0.115367 0.467488 -0.231817 0.007441 -0.047757 -0.056275 0.150657
polarizability: 3.10720477e+02 -9.96391264e+00 2.32238133e+02 2.19790857e+00 4.16556705e+00 1.51231074e+02
1716.lowfreq: -5.9282 -0.0008 -0.0007 -0.0005 3.0602 14.9474 31.6692 41.0553 50.1777
frequency: 31.3739 40.9988 50.0466 72.2227 86.6123 91.1655 107.9775 130.6598 140.3717 151.7244 172.2617 186.9172 203.6776 208.8852 217.1349 223.1162 238.7961 246.9430 257.1034 269.4313 283.6381 294.3236 307.6300 314.0442 362.5939 387.5636 402.0262 418.9166 423.8231 455.1910 460.1743 501.6960 527.8988 536.4175 567.0066 572.4248 606.0126 614.9881 651.9805 664.7595 682.3589 696.9270 728.7158 736.6009 782.0989 789.7651 823.6890 831.2382 832.6519 859.2562 878.9296 910.8032 915.9365 922.2997 932.9332 944.6502 953.3833 954.7348 957.2927 973.3445 990.1671 1004.8060 1010.1612 1029.6614 1052.6854 1060.1215 1089.0132 1110.1077 1114.7924 1119.1896 1123.7621 1128.5162 1140.3487 1151.5578 1162.6980 1172.9540 1176.9814 1186.5351 1202.8037 1208.1747 1225.6407 1236.6556 1260.4188 1264.7688 1275.2658 1292.1227 1296.4324 1306.5124 1314.5687 1324.7002 1330.3743 1333.3358 1354.2293 1372.4617 1376.9631 1379.7357 1389.3745 1396.2034 1403.9427 1436.6737 1448.3389 1452.7788 1454.6846 1458.0500 1464.7286 1466.2955 1468.2420 1471.8983 1474.2999 1476.3706 1479.4180 1481.0875 1489.7066 1497.0826 1571.7670 1606.3073 1669.7101 1698.6530 2906.6565 2951.6503 2954.6902 2971.3592 2976.0041 2981.9524 2984.1604 2989.5826 2989.6836 2994.2696 3017.8232 3031.7568 3035.8851 3037.7909 3043.6714 3050.7501 3059.9573 3065.2898 3069.9949 3074.1196 3076.6841 3083.5547 3087.3249 3109.1853 3119.9151 3148.0841
redmass: 4.4396 3.5382 3.3390 3.3828 3.4796 3.8197 3.6410 3.1087 1.1361 2.9295 3.3677 2.1709 3.2731 1.1734 1.4789 2.5636 2.6810 1.1471 3.2115 4.0449 2.4011 2.7841 2.6014 2.9183 3.4713 3.3838 4.1667 2.7770 3.3340 3.4088 3.3154 4.7382 3.7776 5.3961 3.3204 5.8298 4.9728 2.8984 3.0514 3.8605 4.1172 5.7942 3.8577 3.4255 4.9613 4.2173 3.0579 1.4951 2.2751 2.2216 3.1733 4.5248 1.9899 1.3113 2.2515 2.3734 1.5903 4.0199 1.4170 1.9943 2.7987 2.0261 1.9969 2.3682 2.6605 1.6220 2.0645 1.3071 2.4112 1.5338 2.4821 1.4905 1.8342 1.5091 1.8425 2.0379 1.5324 1.8585 1.5665 2.2662 1.4104 1.8106 2.9102 1.7898 1.6395 1.4947 1.3210 1.8470 1.6300 1.6328 1.3595 1.5016 1.6992 3.1973 1.1959 2.7079 1.2267 1.2223 2.7627 1.2802 1.0865 1.2185 1.0815 1.0811 1.0730 1.0466 1.0518 1.1393 1.0656 1.4669 1.0536 1.0762 1.2253 1.0971 6.4328 7.4543 9.1097 12.5931 1.0798 1.0456 1.0546 1.0349 1.0353 1.0606 1.0391 1.0598 1.0636 1.0587 1.0846 1.0951 1.1034 1.0930 1.1051 1.0987 1.0999 1.1000 1.1000 1.0987 1.0993 1.0997 1.0988 1.1004 1.0868 1.0945
irintensity: 0.6299 0.9719 0.2758 2.9282 1.2844 3.0310 3.7597 0.0840 0.1601 1.0655 5.4201 3.1727 0.0632 0.7062 1.0097 3.8717 4.1255 0.7323 1.3532 2.0020 3.0719 2.4729 1.0588 4.8433 6.1989 3.9579 1.1226 1.2193 0.4240 1.5802 1.9131 1.0927 0.7640 0.1862 2.8136 3.1822 1.4146 0.2490 4.8575 6.2899 4.2528 8.5806 0.3393 2.5899 1.0675 4.2227 6.7846 25.1148 3.1429 5.6923 19.8626 82.9936 12.6869 1.9598 13.6298 8.7152 4.2829 22.4458 1.3852 5.7715 51.4429 16.3350 19.9618 9.3497 36.3006 19.3661 4.9343 0.4550 1.9365 4.4836 1.0741 7.9834 5.3788 8.6470 0.2288 33.4181 8.7404 0.6927 5.7398 9.7071 1.0770 12.3302 22.8258 9.9191 5.8867 7.3656 0.3035 14.8670 1.0512 10.0258 5.6519 8.2735 2.6095 7.3671 16.3422 6.4132 20.0458 11.8750 23.1910 9.2738 7.6632 0.3531 14.3192 9.7554 3.1123 0.6470 6.1328 5.0839 5.6771 10.1655 13.9317 11.3005 37.0141 4.7021 7.2662 2.4888 137.0236 380.6304 12.6060 12.6177 75.6642 35.9537 38.9423 8.8946 28.9220 31.0102 19.4405 42.6340 1.7462 17.5338 48.0837 18.4638 7.8209 27.7960 34.7088 1.6653 35.5749 109.6043 28.3390 32.1872 29.1800 29.3768 15.0496 20.7978
temp: 298.150 k
press: 1.00000 atm
elementType: 8 8 8 6 6 6 6 6 6 6 6 6 6 6 6 6 6 6 6 6 6 6 6 6 1 1 1 1 1 1 1 1 1 1 1 1 1 1 1 1 1 1 1 1 1 1 1 1 1 1
symmnumber: 1
zpe: 1102566.8 jmol-1
zpe.correction: 0.419946 hartree
zpe.thermalcorrener: 0.443056 hartree
zpe.thermalcorrenthalpy: 0.444000 hartree
zpe.thermalcorrgfe: 0.368564 hartree
zpe.sumelectzpe: -1039.710332 hartree
zpe.sumelectthermal: -1039.687221 hartree
zpe.sumelectthermalent: -1039.686277 hartree
zpe.sumelectthermalfe: -1039.761713 hartree
dipole: -6.5353 1.6901 -0.9897
dipole: 6.8224
quadrupole: -192.4690 -132.3756 -142.5082
quadrupole: 6.7310 8.6171 -3.9811
quadrupole: -36.6848 23.4087 13.2761 6.7310 8.6171 -3.9811
hfenergy: -1040.130277 hartree
pointgroup: C01 [X(C21H26O3)]
dipole: 2.5591385 -0.6693659 -0.4554313 debye
polarizability: 310.4604672|-10.2964734|232.413079|-5.8908496|-2.8261291|151.3161375 unknown
InChI: InChI=1S/C21H26O3/c1-12(2)13-5-7-17-15(19(13)23-4)6-8-18-16-11-24-20(22)14(16)9-10-21(17,18)3/h5,7,12,18H,6,8-11H2,1-4H3
charge 0 multiplicity 1
50 atoms
O  -5.371228 -1.113193 0.038129
O  3.359324 -2.006326 0.146332
O  -6.154538 1.082626 -0.259002
C  -0.893106 0.665743 0.283399
C  -1.543497 -0.715261 -0.091548
C  -1.55273 1.751932 -0.631483
C  -0.921589 -1.871937 0.71938
C  0.634335 0.560803 0.080919
C  -3.046145 -0.610334 -0.044772
C  -3.080409 1.905013 -0.386067
C  0.56037 -2.026193 0.317142
C  1.298562 -0.699176 0.141411
C  -1.138917 1.035185 1.780373
C  -3.728228 0.560609 -0.201274
C  -4.033248 -1.745713 0.118894
C  1.422801 1.731293 -0.063656
C  2.718807 -0.732925 0.039049
C  -5.18867 0.306183 -0.15662
C  3.514479 0.434413 -0.080526
C  2.826252 1.671543 -0.138917
C  5.043479 0.374393 -0.107341
C  5.64966 1.116482 1.114654
C  5.618918 0.938799 -1.433791
C  3.640429 -2.652922 -1.147137
H  -1.275576 -0.907018 -1.157771
H  -1.372757 1.475661 -1.689345
H  -1.074254 2.734582 -0.471844
H  -1.453491 -2.822637 0.52052
H  -1.01893 -1.673911 1.802682
H  -3.551322 2.443004 -1.230636
H  -3.273305 2.531082 0.507832
H  0.606418 -2.587095 -0.640482
H  1.109154 -2.647619 1.047258
H  -0.783642 2.064206 1.971128
H  -2.20873 0.9827 2.049774
H  -0.57792 0.369601 2.458249
H  -3.965649 -2.506071 -0.682322
H  -3.954291 -2.25261 1.099002
H  0.936651 2.711403 -0.105019
H  3.399476 2.601343 -0.233981
H  5.335953 -0.688388 -0.022797
H  5.399254 2.193627 1.094769
H  6.751928 1.025261 1.113313
H  5.268459 0.695961 2.062143
H  5.214702 0.401936 -2.31186
H  6.720797 0.84505 -1.448383
H  5.370636 2.010011 -1.553579
H  4.319932 -2.032772 -1.764518
H  2.707947 -2.839206 -1.715919
H  4.126649 -3.611036 -0.905861
