program: Gaussian 09
title: 000156282
version: EM64L-G09RevD.01
frameworkgroup: C1[X(C9H15NO3)]
method: RPBEPBE
basis: SDD
operation: Freq
keyword: #p
keyword: freq=noraman
keyword: PBEPBE/SDD
title: #p freq=noraman PBEPBE/SDD
converged: NO YES NO NO
title: Mulliken charges:
elementType: O O O N C C C C C C C C C H H H H H H H H H H H H H H H
charge: -0.276907 -0.458571 -0.243746 -0.331264 -0.249873 -0.282030 -0.001973 -0.466687 -0.070207 -0.452385 -0.432651 0.275038 -0.755170 0.264423 0.260518 0.254086 0.236061 0.236969 0.230677 0.210952 0.235003 0.278932 0.236100 0.203729 0.357330 0.245253 0.248354 0.248040
chargesum: 0.00000
title: Mulliken charges with hydrogens summed into heavy atoms:
elementType: O O O N C C C C C C C C C
charge: -0.276907 -0.101241 -0.243746 -0.052332 0.014551 -0.021513 0.252113 0.006343 0.160471 -0.006430 0.007178 0.275038 -0.013523
polarizability: 1.30211584e+02 -2.04225666e+00 9.52949694e+01 -1.06845211e-02 -4.02173366e+00 9.59820299e+01
1716.lowfreq: -30.1604 -2.4453 -0.0005 0.0006 0.0007 5.5261 19.3885 37.6483 51.9427
frequency: -30.0485 35.6969 51.7252 89.3482 145.6601 180.0793 231.7925 255.7744 308.1678 325.1934 389.9070 409.9566 455.6113 482.9983 546.5728 568.7586 597.9233 635.5607 648.4261 729.6077 758.6925 786.4915 791.5634 804.5499 833.2155 878.9687 884.6651 927.3106 936.9735 962.2014 977.9659 982.8061 996.7329 1007.7431 1040.4996 1043.4228 1068.3167 1078.4306 1118.6273 1137.3712 1166.0360 1176.4056 1200.2426 1205.7473 1226.9667 1253.3306 1263.6177 1274.9213 1286.0872 1313.1026 1329.9040 1340.9767 1342.3160 1358.0843 1379.0992 1382.7745 1403.1402 1448.8390 1452.6616 1454.9487 1462.1372 1472.1519 1649.3309 2988.7942 3000.0012 3007.4318 3021.3157 3040.7668 3053.6463 3059.1202 3064.7745 3068.0186 3072.2481 3085.8631 3095.2856 3143.0383 3353.2622 3422.0562
redmass: 1.0697 7.6892 3.8826 3.2285 4.9227 3.9490 4.3388 3.3387 2.4853 4.5446 2.5533 2.5016 2.4768 3.2228 3.4516 3.1506 4.4912 1.2674 2.5212 2.7221 3.9302 2.3557 2.3717 3.4796 3.0036 3.1725 2.3313 2.3427 2.2475 2.8801 2.6252 2.3073 2.0625 2.4777 1.6864 2.2867 1.6245 1.9089 2.9369 1.1071 1.1122 1.3056 1.8546 2.2860 1.4101 1.4534 1.4138 1.3708 1.3184 1.5440 1.4881 1.3716 1.4687 1.4010 1.2306 1.2503 1.3738 1.0886 1.0622 1.0476 1.0811 1.0874 9.3997 1.0636 1.0622 1.0368 1.0612 1.0874 1.0976 1.0887 1.0897 1.0985 1.0910 1.1023 1.0974 1.1009 1.0637 1.0754
irintensity: 1.0372 3.0289 1.2809 1.4504 8.9234 8.8040 0.7314 2.7070 2.0584 2.6036 0.7122 1.2866 7.8888 5.7858 1.1125 2.7793 8.1884 84.8003 26.9608 5.0183 2.8325 129.0951 3.6064 3.8638 7.4155 30.6655 16.7505 31.6086 3.4217 18.6994 26.0196 33.3612 123.7418 14.7135 10.0973 3.1797 17.6385 30.0954 32.9117 17.5709 66.4273 40.3168 67.7207 221.0525 31.9048 1.8733 5.0475 3.2104 0.6540 1.4729 0.8473 2.3486 0.3936 3.9611 78.6869 44.6378 30.1143 10.1157 26.5509 20.8688 14.6980 11.8607 178.8636 23.7261 34.1597 2.7167 17.5237 33.2467 16.7482 22.5716 57.7439 38.9869 2.2862 24.6434 8.1934 10.3853 44.8636 0.7425
temp: 298.150 k
press: 1.00000 atm
elementType: 8 8 8 7 6 6 6 6 6 6 6 6 6 1 1 1 1 1 1 1 1 1 1 1 1 1 1 1
symmnumber: 1
zpe: 618611.4 jmol-1
zpe.correction: 0.235617 hartree
zpe.thermalcorrener: 0.247169 hartree
zpe.thermalcorrenthalpy: 0.248113 hartree
zpe.thermalcorrgfe: 0.197289 hartree
zpe.sumelectzpe: -631.351565 hartree
zpe.sumelectthermal: -631.340013 hartree
zpe.sumelectthermalent: -631.339068 hartree
zpe.sumelectthermalfe: -631.389893 hartree
dipole: 2.7349 -0.9744 1.2743
dipole: 3.1707
quadrupole: -92.2395 -75.8634 -76.4589
quadrupole: -10.5568 5.2817 2.5822
quadrupole: -10.7189 5.6572 5.0617 -10.5568 5.2817 2.5822
hfenergy: -631.5871818 hartree
pointgroup: C01 [X(C9H15N1O3)]
dipole: -1.064562 -0.3849229 0.5240798 debye
polarizability: 130.2308932|1.1130402|93.2439338|-1.3740679|-3.3137119|98.0137559 unknown
InChI: InChI=1S/C9H15NO3/c1-5(11)13-9-4-7-8(12)3-2-6(9)10-7/h6-10,12H,2-4H2,1H3
charge 0 multiplicity 1
28 atoms
O  -1.848111 -0.401138 0.419293
O  3.622288 0.530477 0.658182
O  -3.098076 0.432689 -1.367285
N  1.098117 -0.215141 1.367663
C  0.490629 -1.085855 0.304383
C  1.247288 1.095692 0.644411
C  -0.588723 -0.190054 -0.368518
C  -0.063849 1.264956 -0.189098
C  2.518492 0.904316 -0.234403
C  1.61495 -1.455468 -0.696175
C  2.269939 -0.186095 -1.308999
C  -3.049334 -0.050446 -0.214009
C  -4.227411 -0.352526 0.687136
H  0.041091 -1.989386 0.747682
H  1.417184 1.913222 1.364305
H  -0.803453 -0.446994 -1.419371
H  -0.806642 1.859151 0.371239
H  0.100761 1.766023 -1.158374
H  2.818238 1.85656 -0.706461
H  1.214768 -2.105991 -1.496626
H  2.375199 -2.0393 -0.145826
H  0.477738 -0.13279 2.187285
H  3.236604 -0.441533 -1.777684
H  1.624458 0.226951 -2.109503
H  3.1869 -0.0765 1.328781
H  -4.123867 0.183559 1.646252
H  -4.261715 -1.431829 0.916704
H  -5.160564 -0.051149 0.190316
