program: Gaussian 09
title: 000156274
version: EM64L-G09RevD.01
frameworkgroup: C1[X(C23H26O3)]
method: RPBEPBE
basis: SDD
operation: Freq
keyword: #pfreq=noraman
keyword: PBEPBE/SDD
title: #p freq=noraman PBEPBE/SDD
converged: YES YES NO NO
title: Mulliken charges:
elementType: O O O C C C C C C C C C C C C C C C C C C C C C C C H H H H H H H H H H H H H H H H H H H H H H H H H H
charge: -0.263175 -0.288105 -0.306741 0.312478 -0.269610 -0.386596 -0.737854 -0.748036 -0.265317 0.285351 0.361326 -0.791426 -0.794718 -0.490631 0.471329 -0.364633 -0.352592 -0.390142 -0.366708 0.332635 0.346579 -0.360964 -0.385220 -0.204625 -0.193865 -0.251338 0.259173 0.264495 0.222920 0.212948 0.220621 0.208465 0.211463 0.261015 0.197549 0.227564 0.218135 0.216953 0.237122 0.219926 0.221100 0.237744 0.222517 0.237025 0.269136 0.256789 0.267514 0.267047 0.257082 0.228336 0.229786 0.230174
chargesum: 0.00000
title: Mulliken charges with hydrogens summed into heavy atoms:
elementType: O O O C C C C C C C C C C C C C C C C C C C C C C C
charge: -0.263175 -0.288105 -0.306741 0.312478 -0.010437 -0.122102 -0.081365 -0.067094 -0.067768 0.285351 0.361326 -0.128775 -0.116570 -0.030369 0.471329 -0.127607 -0.083456 -0.133353 -0.099194 0.332635 0.346579 -0.093917 -0.128138 0.023711 0.035921 -0.021164
polarizability: 3.86305814e+02 2.61370007e+01 2.47328418e+02 2.15299004e+00 -1.34924379e+01 1.87713682e+02
1716.lowfreq: -5.2491 -3.7354 -0.0010 -0.0008 0.0008 2.7655 9.4433 11.3638 18.2506
frequency: 9.2879 11.2506 18.2399 22.5935 29.2145 38.9196 59.2931 70.7921 87.2605 97.2700 114.5493 131.0985 135.2494 154.1458 170.6138 176.5684 199.2843 205.9864 223.6871 239.2902 257.3573 272.6904 282.5903 300.1688 325.6035 337.3271 358.6034 379.6285 391.7151 409.2337 413.7619 415.2189 443.4518 464.0174 475.1904 498.2137 507.4780 510.6595 566.3205 599.4009 612.4690 621.7012 637.3663 679.4413 690.9210 697.8414 727.6465 741.8252 767.5793 794.3884 808.2047 820.6601 830.5340 834.6280 840.4286 854.9741 858.1530 863.3567 881.4840 906.9030 940.8008 948.9954 957.3994 960.4648 967.0832 976.4829 976.9786 984.2925 986.4771 987.7621 991.3194 1007.1754 1012.0382 1019.7803 1036.7220 1052.1814 1074.4763 1077.4128 1081.6553 1115.2466 1116.5545 1125.9029 1152.4848 1165.3737 1169.1894 1174.1000 1189.3289 1197.2964 1217.1455 1228.0198 1234.6788 1243.3556 1287.3660 1301.7351 1311.7731 1324.4037 1344.9349 1370.2093 1378.6380 1386.8389 1388.3525 1388.6518 1398.6660 1400.7233 1415.8825 1418.8414 1441.9700 1454.1618 1460.1801 1461.8619 1465.9771 1471.3648 1471.5917 1471.7705 1475.6052 1482.7738 1490.4415 1494.6554 1586.0242 1596.1039 1603.9425 1608.9374 1620.7389 1685.2555 2956.0908 2964.7757 2973.9917 2977.7002 3026.6647 3031.7670 3035.5641 3057.7649 3066.0804 3077.9572 3080.6232 3092.4833 3096.5055 3096.9377 3110.0642 3120.8083 3130.7480 3130.8461 3140.1987 3145.3972 3152.1504 3156.3321 3164.6603 3166.0867 3169.9733 3174.7269
redmass: 3.9325 4.8907 4.1930 3.3095 4.7852 4.3665 3.9297 4.0924 4.3452 3.8082 1.1606 3.0684 3.5759 2.2404 1.2294 1.2477 3.7062 2.9355 1.7988 3.0936 3.6324 4.2547 3.3275 4.6985 3.4909 3.3515 2.8907 2.5983 3.2558 2.9064 2.7681 2.6493 2.9844 3.1163 3.4992 3.0443 3.0170 3.8095 5.5383 4.4414 5.6594 4.3756 6.4635 4.9776 2.5403 3.7859 5.2443 2.9114 2.0237 3.3181 3.8318 3.2711 1.4047 2.6147 1.3925 5.2399 1.7414 2.1130 3.0423 1.4255 2.2874 1.4091 1.3656 1.5084 1.3655 1.4723 1.3671 1.8135 4.0255 1.4460 1.2566 2.7183 1.6128 2.0995 1.7274 1.6898 1.3866 1.5075 1.5823 2.1623 1.2947 1.8238 2.1696 2.5452 1.1103 1.1710 1.4176 2.0907 2.4651 4.6239 1.1812 2.4651 1.7947 1.3359 1.3028 1.6494 1.3374 1.6766 5.7718 1.2401 7.6118 1.2796 1.2271 1.2838 3.1975 2.1855 2.3100 1.0499 1.1278 1.0542 1.0516 1.1075 1.9339 1.0763 1.0806 1.1382 1.0690 2.6201 7.0110 6.4795 6.5217 8.8386 6.4989 6.3379 1.0373 1.0390 1.0368 1.0363 1.0969 1.0963 1.0585 1.0989 1.0989 1.0981 1.0981 1.0890 1.0981 1.0964 1.1074 1.0876 1.0877 1.0871 1.0891 1.0888 1.0891 1.0931 1.0964 1.0957 1.0961 1.1004
irintensity: 0.2023 0.0405 0.1770 0.2685 1.5915 0.5140 0.0245 0.2612 1.8504 2.2850 0.3179 0.5748 0.4055 1.3471 0.5550 0.1429 2.2134 1.7427 0.1574 5.8196 1.6323 3.8873 1.7600 5.9494 9.0335 7.7536 2.3642 4.7606 1.4997 1.0306 2.1292 0.3218 4.0975 0.0317 25.2103 15.1683 1.6600 10.6573 20.0088 6.8764 2.8688 3.7863 2.4144 4.5503 21.2508 12.2617 12.9534 35.9633 60.4777 68.5023 33.8212 3.4629 7.9261 48.2044 5.9900 60.0604 6.8522 31.4215 47.3932 5.2537 40.8898 1.1237 0.3823 6.5960 0.8614 26.4795 2.0235 42.9791 0.5773 0.6383 2.3853 11.6616 24.8604 12.4480 26.2509 28.2668 6.3261 11.1313 5.9082 478.0159 14.3561 0.0469 3.1074 75.7501 7.6524 50.6856 22.3498 56.9436 183.1887 321.2333 17.0690 34.7326 53.1974 3.8733 0.2206 23.8444 9.3991 87.1775 2.8355 2.7245 0.1591 45.8238 8.1910 21.5539 2.1728 59.3730 2.5049 2.6016 23.9373 10.8585 7.3784 12.8466 156.2674 42.3645 1.7384 19.1127 10.9126 125.7926 1.7023 37.2394 104.7536 140.6536 26.2659 6.6735 50.5171 65.7674 26.0025 44.8983 10.9824 39.5033 38.0370 19.5374 47.2390 20.6161 29.0778 29.0910 9.7850 30.4352 6.5026 11.7591 13.8794 3.1301 10.8572 5.3359 4.1881 29.5840 10.1726 8.5451 4.0140 9.0278
temp: 298.150 k
press: 1.00000 atm
elementType: 8 8 8 6 6 6 6 6 6 6 6 6 6 6 6 6 6 6 6 6 6 6 6 6 6 6 1 1 1 1 1 1 1 1 1 1 1 1 1 1 1 1 1 1 1 1 1 1 1 1 1 1
symmnumber: 1
zpe: 1118503.5 jmol-1
zpe.correction: 0.426015 hartree
zpe.thermalcorrener: 0.452546 hartree
zpe.thermalcorrenthalpy: 0.453491 hartree
zpe.thermalcorrgfe: 0.364156 hartree
zpe.sumelectzpe: -1115.777807 hartree
zpe.sumelectthermal: -1115.751276 hartree
zpe.sumelectthermalent: -1115.750332 hartree
zpe.sumelectthermalfe: -1115.839666 hartree
dipole: -1.1711 1.0945 0.6321
dipole: 1.7230
quadrupole: -136.2108 -144.3415 -155.3209
quadrupole: 4.5086 -5.4898 -1.2653
quadrupole: 9.0803 0.9495 -10.0298 4.5086 -5.4898 -1.2653
hfenergy: -1116.2038225 hartree
pointgroup: C01 [X(C23H26O3)]
dipole: 0.4501161 0.5023715 -0.0674881 debye
polarizability: 386.2720225|-20.9315965|226.634971|-15.3112802|31.7597709|208.4409203 unknown
InChI: InChI=1S/C23H26O3/c1-16(2)14-20-21(23(20,3)4)22(24)25-15-17-10-12-19(13-11-17)26-18-8-6-5-7-9-18/h5-14,20-21H,15H2,1-4H3
charge 0 multiplicity 1
52 atoms
O  1.754006 -1.356966 -1.253111
O  2.024751 -0.861231 1.018669
O  -4.685283 -0.72366 -0.697186
C  3.304625 1.849098 -0.110794
C  4.423156 0.850874 0.226103
C  3.234541 0.404465 -0.700444
C  3.562421 2.961326 -1.127769
C  2.351029 2.255878 1.010961
C  5.80266 0.935568 -0.317569
C  2.301152 -0.62386 -0.188276
C  6.939696 0.437863 0.255976
C  8.289132 0.617678 -0.42008
C  6.987147 -0.317035 1.572411
C  0.79587 -2.462633 -0.877754
C  -0.632268 -1.974453 -0.812123
C  -1.468061 -2.028072 -1.957153
C  -1.168617 -1.465381 0.399182
C  -2.801687 -1.576403 -1.90438
C  -2.502069 -1.013078 0.470732
C  -3.311765 -1.067754 -0.689145
C  -5.20167 0.281937 0.160964
C  -4.498878 1.474065 0.454595
C  -6.518059 0.077136 0.628791
C  -5.129316 2.463179 1.2420
C  -7.136423 1.077224 1.410666
C  -6.44513 2.271218 1.724825
H  4.328405 0.423382 1.23108
H  3.443705 0.321467 -1.770464
H  2.603968 3.337471 -1.530949
H  4.174787 2.625643 -1.982634
H  4.086892 3.808636 -0.646836
H  1.381318 2.593116 0.59761
H  2.786582 3.096007 1.584267
H  2.154103 1.421804 1.704322
H  5.910439 1.45512 -1.280971
H  8.204198 1.174903 -1.369191
H  8.758232 -0.362941 -0.637745
H  8.994444 1.164906 0.237304
H  5.99625 -0.461662 2.031237
H  7.628432 0.214005 2.304033
H  7.439412 -1.318228 1.426814
H  1.128713 -2.880112 0.088062
H  0.942554 -3.19331 -1.688789
H  -1.069949 -2.421604 -2.900036
H  -0.527887 -1.419307 1.286485
H  -3.45763 -1.615905 -2.778879
H  -2.910213 -0.639314 1.414583
H  -3.487381 1.631313 0.067321
H  -7.033664 -0.853021 0.371915
H  -4.590493 3.389524 1.470188
H  -8.157551 0.921177 1.775538
H  -6.926823 3.043648 2.333449
