program: Gaussian 09
title: 000156273
version: EM64L-G09RevD.01
frameworkgroup: C1[X(C8H16O2)]
method: RPBEPBE
basis: SDD
operation: Freq
keyword: #pfreq=noraman
keyword: PBEPBE/SDD
title: #p freq=noraman PBEPBE/SDD
converged: YES YES NO NO
title: Mulliken charges:
elementType: O O C C C C C C C C H H H H H H H H H H H H H H H H
charge: -0.293961 -0.260232 0.008603 -0.387092 -0.010280 -0.339124 -0.346426 -0.350369 -0.691235 -0.695412 0.196124 0.216894 0.206129 0.219574 0.194330 0.234478 0.221167 0.179905 0.199288 0.192361 0.221037 0.239401 0.207714 0.209385 0.212574 0.215170
chargesum: 0.00000
title: Mulliken charges with hydrogens summed into heavy atoms:
elementType: O O C C C C C C C C
charge: -0.293961 -0.260232 0.204726 0.035931 0.209294 0.089683 0.054646 0.041280 -0.023084 -0.058284
polarizability: 1.15976038e+02 -1.78652800e+00 8.44334088e+01 2.05667766e+00 -1.57522162e-01 7.70271363e+01
1716.lowfreq: -0.0010 -0.0007 -0.0002 2.1434 10.6196 17.0240 28.4707 52.1944 75.2206
frequency: 27.3142 52.0965 75.1871 95.3996 127.5095 191.3884 210.3363 221.2140 242.9390 287.8330 323.7620 426.5041 441.7908 503.4372 587.3371 657.2609 728.2339 749.3094 805.8318 841.2871 872.4871 888.7090 925.0755 932.8697 950.7948 988.8509 1026.7974 1061.9521 1078.1447 1090.2477 1113.5668 1128.3687 1138.1883 1157.0837 1193.9470 1211.1958 1247.5854 1269.6138 1279.4220 1290.5390 1306.8832 1310.7219 1326.4555 1354.1566 1360.4079 1377.1747 1389.6921 1390.7796 1449.3674 1457.9547 1467.0813 1469.1190 1476.6113 1476.9792 1477.6705 1488.2541 2932.1293 2961.1113 2962.1646 2969.4860 2972.6113 2985.8392 2989.8408 2992.0484 3007.2546 3033.4316 3062.4290 3070.3041 3071.8453 3081.0423 3098.0644 3103.6149
redmass: 3.0959 3.1449 1.9244 2.7784 2.1891 2.9636 1.1112 1.1836 2.1433 4.0758 2.8303 2.6362 2.6612 2.8692 3.4343 5.8120 1.2909 1.8353 1.6507 2.7424 2.4729 2.0361 2.2069 1.4483 1.4603 4.0971 3.8255 2.3071 2.3316 2.2500 1.9828 1.9474 2.0264 2.1961 1.2648 1.4290 1.2515 1.2030 1.1869 1.0625 1.2360 1.2309 1.3090 1.4805 1.5216 1.5954 1.2275 1.2596 1.0893 1.0562 1.0849 1.0646 1.0427 1.0656 1.0548 1.0853 1.0849 1.0678 1.0616 1.0621 1.0364 1.0376 1.0790 1.0658 1.0958 1.0999 1.1024 1.1007 1.0998 1.0984 1.0992 1.0988
irintensity: 3.8684 0.2536 0.7759 0.2434 0.5495 4.4170 0.5367 0.1923 3.0197 2.1451 0.7266 3.2862 5.2016 11.6474 1.3267 5.5174 3.5580 20.6428 6.3533 41.7251 15.8571 15.4315 27.8301 5.6711 6.4587 57.1026 18.8698 36.0097 0.3468 87.4447 5.4138 4.2648 8.8740 20.2895 8.8615 2.5227 2.1369 1.1850 2.4898 1.7396 12.3545 2.1183 5.5418 9.9400 1.6613 29.9353 15.3368 19.2199 6.1100 6.7552 9.6409 0.3802 11.2763 2.4319 10.4398 18.7932 66.0554 45.6419 17.2111 62.9006 37.7396 31.2288 34.6522 43.3940 9.3816 9.0920 10.6315 107.5921 69.2108 26.4750 22.2126 39.5202
temp: 298.150 k
press: 1.00000 atm
elementType: 8 8 6 6 6 6 6 6 6 6 1 1 1 1 1 1 1 1 1 1 1 1 1 1 1 1
symmnumber: 1
zpe: 600010.6 jmol-1
zpe.correction: 0.228532 hartree
zpe.thermalcorrener: 0.240374 hartree
zpe.thermalcorrenthalpy: 0.241318 hartree
zpe.thermalcorrgfe: 0.189457 hartree
zpe.sumelectzpe: -464.044417 hartree
zpe.sumelectthermal: -464.032575 hartree
zpe.sumelectthermalent: -464.031631 hartree
zpe.sumelectthermalfe: -464.083492 hartree
dipole: -1.3599 0.3837 0.2035
dipole: 1.4275
quadrupole: -53.3222 -67.7622 -61.0333
quadrupole: -2.2971 0.7651 -0.9829
quadrupole: 7.3837 -7.0563 -0.3274 -2.2971 0.7651 -0.9829
hfenergy: -464.2729491 hartree
pointgroup: C01 [X(C8H16O2)]
dipole: -0.5334959 -0.1555931 -0.0812445 debye
dipolederiv: -0.9840702 -0.2966328 0.1442886 -0.2530877 -0.6715067 0.0760158 0.1994798 0.1232716 -0.4278367 -0.9782825 0.0577985 0.0397063 0.010517 -0.601284 0.0054378 0.1234354 0.052165 -0.3968396 1.0540248 0.0496182 -0.0945853 0.1684087 0.7290259 -0.124986 -0.1682661 -0.1250126 0.633831 -0.2127764 0.0162913 -0.0303127 -0.0141744 0.0903674 -0.0325451 -0.096428 -0.0371191 0.0498045 0.6667144 0.2679471 -0.1336408 0.0429371 0.2250963 0.0245689 -0.1936354 -0.0175384 0.3863015 0.4751851 0.006361 0.0430124 0.2188391 0.1815004 0.0171281 0.0892565 -0.0138883 0.3421815 -0.0034584 0.0215437 -0.0297505 -0.0277718 0.0672196 -0.0493079 -0.07856 -0.0591901 0.1421728 0.0680618 0.0279394 -0.0066664 0.068467 0.1402971 -0.0378514 0.0354031 -0.0368347 0.1341439 -0.0301109 -0.0791068 -0.0411554 -0.1140607 -0.0620261 -0.0399951 -0.0401271 -0.0435919 0.032057 -0.0614254 0.0621365 0.0226967 0.0427413 0.0453942 -0.0266273 -0.0059265 -0.0245215 0.0779647 -0.0516096 -0.0132925 -0.0009916 -0.0176896 -0.0241316 0.0119408 0.0785768 0.0360957 -0.2409141 0.0558145 0.0065356 0.018686 0.0163019 0.0786161 0.0264358 0.0192894 -0.0036154 -0.1348897 0.0314824 -0.0682045 0.0142337 -0.0452174 -0.1350363 0.0319944 0.0073657 0.0521434 0.0744132 -0.0377392 -0.0253934 -0.0054776 -0.0043107 0.0206678 -0.0039262 0.062349 0.0264665 -0.2067533 -0.0625531 -0.0158762 -0.0587103 -0.0709497 0.0416085 -0.018853 -0.1641866 0.0184099 -0.1579506 -0.0514407 0.0518181 0.0594744 0.0688815 0.0523839 -0.0471026 0.1046613 -0.0740474 0.0152307 0.0671398 -0.0401464 -0.0039906 -0.0454046 -0.131095 0.0132727 -0.0007041 0.0323118 0.0648795 0.0376745 0.0102243 0.0110391 0.0062403 0.0628733 0.029945 0.016361 0.006144 -0.2008078 0.0291148 0.0110175 0.0493298 0.0084895 0.0664736 0.0224549 0.0077232 0.0026512 -0.2007287 0.0147465 -0.0269744 -0.0004747 -0.0641872 -0.2031202 0.0093697 0.0065907 0.0392534 0.0686098 0.0942398 -0.0110781 0.0148898 -0.0099648 0.0756014 0.0555999 -0.0307676 -0.0060192 -0.1422332 0.0823264 0.0849779 -0.0262653 0.0253246 -0.1113453 0.042728 -0.0377944 0.0449654 0.0839164 -0.1587915 -0.0223499 0.0732736 0.0207741 0.0840312 -0.0248687 0.0838897 -0.0207038 0.0648351 0.0851589 0.0141308 0.0073541 0.0117116 0.0698283 0.0458951 0.0701827 0.0135371 -0.1838021 0.0727208 -0.0833545 0.0219068 -0.017108 -0.1706248 0.0230979 0.0268826 0.0366099 0.0785693 -0.2021464 -0.0059301 -0.08787 -0.0257071 0.079185 -0.0298214 -0.115051 -0.0219426 0.043845 unknown
polarizability: 115.8061938|2.5659481|84.5084572|-2.6111685|0.2860324|77.1219322 unknown
InChI: InChI=1S/C8H16O2/c1-3-4-5-8-9-6-7(2)10-8/h7-8H,3-6H2,1-2H3
charge 0 multiplicity 1
26 atoms
O  -0.913895 -0.791712 0.057659
O  -1.400389 1.518367 0.189958
C  -0.415786 0.559021 -0.324735
C  0.949565 0.839289 0.287737
C  -2.319727 -0.645543 0.542713
C  -2.687304 0.799307 0.128096
C  2.047665 -0.100032 -0.258287
C  3.42605 0.162456 0.388632
C  -3.189188 -1.7405 -0.076292
C  4.531796 -0.761432 -0.165545
H  -0.397028 0.596425 -1.437488
H  0.859084 0.734539 1.38506
H  1.209954 1.894838 0.072893
H  -2.301777 -0.734501 1.647061
H  -3.098333 0.819498 -0.903731
H  -3.375252 1.305226 0.822487
H  1.745522 -1.150403 -0.079844
H  2.131624 0.023239 -1.35861
H  3.343375 0.026414 1.486136
H  3.712101 1.222217 0.227177
H  -3.193413 -1.656511 -1.177415
H  -2.8009 -2.737764 0.191715
H  -4.230169 -1.666565 0.291529
H  4.661307 -0.615447 -1.254723
H  4.278411 -1.825357 0.001301
H  5.505509 -0.56507 0.319916
