program: Gaussian 09
title: 000156271
version: EM64L-G09RevD.01
frameworkgroup: C1[X(C24H26N2O5)]
method: RPBEPBE
basis: SDD
operation: Freq
keyword: #p
keyword: freq=noraman
keyword: PBEPBE/SDD
title: #p freq=noraman PBEPBE/SDD
converged: YES YES NO NO
title: Mulliken charges:
elementType: O O O O O N N C C C C C C C C C C C C C C C C C C C C C C C C H H H H H H H H H H H H H H H H H H H H H H H H H H
charge: -0.307783 -0.411366 -0.226221 -0.214458 -0.297394 -0.176336 -0.433659 -0.144801 -0.476035 -0.474363 -0.349896 0.285035 -0.515801 0.189412 -0.540472 -0.129448 0.267367 -0.669343 0.502822 0.209554 -0.390929 -0.449630 0.253223 -0.230348 -0.232114 -0.241156 -0.350501 -0.352975 -0.225309 -0.237273 -0.228229 0.310173 0.241233 0.247565 0.235219 0.246832 0.234025 0.237919 0.256807 0.239932 0.235997 0.276900 0.260876 0.239649 0.283099 0.326604 0.378868 0.238381 0.244278 0.226365 0.226601 0.229854 0.272191 0.219263 0.230737 0.228152 0.230907
chargesum: 0.00000
title: Mulliken charges with hydrogens summed into heavy atoms:
elementType: O O O O O N N C C C C C C C C C C C C C C C C C C C C C C C C
charge: -0.307783 -0.032498 -0.226221 -0.214458 -0.297394 -0.176336 -0.107055 0.165372 0.012764 0.007689 0.122048 0.285035 -0.019062 0.189412 -0.027575 0.131428 0.267367 -0.146595 0.502822 0.209554 -0.152548 -0.205352 0.253223 -0.003983 -0.005513 -0.011303 -0.078309 -0.133712 0.005428 -0.009121 0.002678
polarizability: 3.38214763e+02 -3.17021301e+00 2.79370809e+02 -1.69958015e+01 1.03518514e+01 2.33463086e+02
1716.lowfreq: -8.0326 0.0002 0.0007 0.0009 3.4779 5.0352 11.2768 15.4267 19.5391
frequency: 11.1165 15.3800 19.5299 22.3062 26.7139 29.7005 35.4465 44.4818 52.4988 60.7397 63.2958 82.0669 95.7454 97.9577 124.1609 131.1328 141.8184 162.1688 173.2547 206.6819 217.4077 235.2598 258.2214 278.6465 294.1249 302.8235 319.8700 338.3925 355.2509 372.9162 387.3391 401.9482 403.8386 417.9133 465.6892 481.9750 511.9556 520.5982 537.1366 550.3193 559.1052 565.1471 583.4778 595.6699 615.2003 617.6524 623.2504 654.9950 680.5533 683.0866 698.0342 705.0792 706.5043 707.3956 754.1893 782.5819 789.8932 793.9811 828.3301 837.4662 853.8910 855.7422 864.8599 869.8180 903.0574 913.2830 918.8082 922.3739 925.8617 935.8794 954.1953 976.6921 979.8583 982.6172 989.4687 989.9633 995.8861 998.7672 1003.4596 1005.5371 1023.2893 1026.5524 1035.1168 1045.8348 1061.6652 1075.1007 1082.2821 1087.9169 1100.5217 1104.6314 1142.0943 1150.5849 1165.2892 1171.3538 1172.6488 1172.9416 1186.2130 1190.0778 1190.5087 1205.3064 1206.8447 1217.0582 1234.3158 1250.5858 1263.9538 1267.0763 1291.8550 1300.7039 1308.5326 1315.8980 1321.7980 1326.6085 1332.8341 1334.5400 1347.4476 1357.6779 1361.1340 1381.8994 1384.9746 1405.3965 1425.1230 1428.2365 1432.8293 1440.0632 1461.7551 1470.6347 1474.9707 1477.3457 1483.4300 1489.3555 1494.5646 1557.8783 1574.7349 1590.8950 1599.6911 1612.4082 1612.6609 1634.2565 1667.3151 2977.0908 2985.7684 2988.7584 3006.5851 3007.7150 3021.7746 3024.9532 3045.9392 3052.0414 3067.7735 3069.6065 3071.4495 3089.2839 3102.2349 3106.9896 3118.1484 3124.0301 3131.9136 3132.4114 3144.1505 3145.3057 3157.8956 3162.8489 3169.1468 3515.9040 3532.8095
redmass: 5.5088 5.8087 4.7493 4.7405 4.5891 4.3068 5.8535 8.4689 7.9731 4.4206 6.1026 6.5490 4.2409 6.3597 4.4412 4.9486 5.3530 3.4436 4.8150 3.7625 4.0419 2.6322 2.2727 3.9550 5.2667 6.4636 4.5486 4.7794 2.5224 4.4762 5.1812 2.8103 2.8252 4.8221 3.9791 3.7078 4.2584 3.5702 2.9753 1.4857 1.8331 2.2793 3.6775 1.9423 6.2837 6.2899 2.1250 6.2732 5.1551 3.9747 2.6361 1.8800 1.9903 3.4465 1.8109 3.2715 2.9975 2.5709 4.6686 3.9460 1.2539 1.2553 3.2726 1.9295 1.6207 2.3405 2.5547 2.4785 1.6060 1.4665 3.3299 1.4099 2.0596 1.4154 5.8632 5.3994 1.3362 2.4645 1.3644 2.8464 2.5984 2.2063 2.4443 2.6397 1.8040 2.3461 1.5757 1.8411 1.9059 1.8358 1.8876 1.4519 1.4357 1.3204 1.0561 1.0606 1.1173 1.1645 2.2004 1.8140 1.4747 2.6511 1.2644 1.6195 1.7120 1.2832 2.0723 1.3942 1.5371 1.3267 1.3548 1.3275 1.3428 1.4343 1.2889 1.6631 1.6596 7.0384 9.1010 4.9779 1.1415 1.0877 2.2301 2.1512 1.9391 1.0865 1.0924 1.2521 2.0070 1.0923 2.4255 6.8013 7.9269 6.0011 6.5530 6.0572 6.1411 7.9905 8.6432 1.0637 1.0822 1.0613 1.0610 1.0625 1.0629 1.0645 1.0993 1.0980 1.1026 1.0859 1.0981 1.1022 1.1054 1.0882 1.0868 1.0854 1.0901 1.0878 1.0955 1.0925 1.0959 1.1013 1.1007 1.0641 1.0781
irintensity: 0.2137 1.0259 1.4198 0.2506 0.1224 0.3977 0.2856 6.1766 1.7359 0.9889 3.7709 6.4213 1.9714 0.8944 2.1981 1.0271 1.9576 2.1253 2.2498 2.9269 5.5382 6.0283 1.1088 34.3880 0.9374 10.0825 2.6354 22.4027 1.5502 8.0317 16.1325 0.2577 0.1374 8.6378 1.0930 10.2333 6.4876 34.8686 11.8942 25.4189 55.2550 15.1469 12.8812 49.1032 0.3923 0.4611 60.0296 7.9836 14.8024 18.4787 9.6198 94.1702 45.0607 21.4238 45.6433 1.1785 4.1808 13.9748 22.7282 2.1679 1.8863 0.4912 12.2096 4.4992 9.2344 17.6886 5.9801 0.5750 8.7333 1.9351 9.0862 0.8150 7.3993 1.2402 0.3751 0.6901 0.2358 13.8533 2.0370 7.7482 13.0632 16.1624 53.8634 277.3750 22.9798 3.6938 15.5927 12.8318 6.9325 27.0268 3.8011 9.2717 8.8830 7.3900 0.0401 0.8507 0.4297 14.9086 6.2766 12.2346 45.1601 0.0628 8.9887 17.5953 9.2092 49.4802 57.0082 4.4874 16.6355 3.9670 13.4838 2.8161 4.3452 1.1421 37.0459 44.8775 37.3323 5.0231 1.2017 219.4181 110.1583 22.4465 6.9052 6.0547 266.9673 8.6304 17.2603 17.4998 14.8313 2.7113 152.7955 107.8000 331.6460 2.6328 30.8183 5.6871 8.1464 61.4444 169.8286 39.0283 20.5738 29.8085 4.4801 8.2063 19.9083 22.3845 7.0158 19.4029 5.6983 4.5672 12.9223 19.6353 31.7518 10.7748 5.9328 5.6250 6.9902 4.4603 34.7065 26.6288 17.6335 25.8756 22.5672 26.6995 56.5176
temp: 298.150 k
press: 1.00000 atm
elementType: 8 8 8 8 8 7 7 6 6 6 6 6 6 6 6 6 6 6 6 6 6 6 6 6 6 6 6 6 6 6 6 1 1 1 1 1 1 1 1 1 1 1 1 1 1 1 1 1 1 1 1 1 1 1 1 1 1
symmnumber: 1
zpe: 1198366.2 jmol-1
zpe.correction: 0.456434 hartree
zpe.thermalcorrener: 0.485824 hartree
zpe.thermalcorrenthalpy: 0.486768 hartree
zpe.thermalcorrgfe: 0.389241 hartree
zpe.sumelectzpe: -1413.562536 hartree
zpe.sumelectthermal: -1413.533145 hartree
zpe.sumelectthermalent: -1413.532201 hartree
zpe.sumelectthermalfe: -1413.629728 hartree
dipole: 1.3647 0.8294 1.8204
dipole: 2.4215
quadrupole: -136.7781 -172.9239 -177.2817
quadrupole: -12.4963 2.5182 -1.7867
quadrupole: 25.5498 -10.5960 -14.9538 -12.4963 2.5182 -1.7867
hfenergy: -1414.0189693 hartree
pointgroup: C01 [X(C24H26N2O5)]
dipole: 0.4555606 0.4114979 0.7285435 debye
polarizability: 338.747719|5.9671853|279.9481681|-15.2176146|7.4583415|232.3527708 unknown
InChI: InChI=1S/C24H26N2O5/c27-21(13-14-22(28)26-15-7-12-20(26)24(30)31)19(16-17-8-3-1-4-9-17)25-23(29)18-10-5-2-6-11-18/h1-6,8-11,19-20,25,30H,7,12-16H2
charge 0 multiplicity 1
57 atoms
O  2.653688 1.007362 -0.208242
O  5.843359 3.128054 0.524565
O  6.070477 1.511478 -1.130728
O  0.374555 -1.379676 1.012397
O  -1.8518 -2.356957 -1.292187
N  4.455188 -0.263429 0.474361
N  -2.231802 -0.480405 -0.004862
C  5.10774 0.907265 1.088976
C  6.230126 0.269737 1.960277
C  6.608499 -1.010259 1.171029
C  5.253198 -1.510326 0.613706
C  3.234299 -0.128296 -0.15244
C  2.62796 -1.397567 -0.7616
C  5.699845 1.831921 0.017238
C  1.205535 -1.127687 -1.270394
C  -0.946904 0.10143 -0.41329
C  0.225613 -0.873078 -0.129263
C  -0.673863 1.422518 0.371998
C  -1.778808 2.452275 0.195231
C  -2.613971 -1.712292 -0.4938
C  -1.911803 3.173511 -1.02058
C  -2.713044 2.702357 1.234687
C  -3.953095 -2.24372 -0.061935
C  -2.950752 4.112869 -1.19512
C  -3.756053 3.6430 1.064135
C  -3.87997 4.348929 -0.153585
C  -4.546102 -3.256134 -0.858425
C  -4.624928 -1.795745 1.105815
C  -5.800929 -3.795849 -0.508789
C  -5.879137 -2.340444 1.458157
C  -6.473586 -3.336306 0.648581
H  4.38707 1.496919 1.677865
H  5.807919 0.010586 2.947674
H  7.079296 0.953927 2.118621
H  7.101955 -1.768141 1.801452
H  7.28533 -0.75618 0.336752
H  4.757355 -2.208282 1.317366
H  5.367036 -2.020845 -0.358659
H  2.604756 -2.198919 0.001024
H  3.273621 -1.749259 -1.590106
H  1.198374 -0.271441 -1.966792
H  0.810804 -2.003143 -1.822629
H  -0.968903 0.308839 -1.501714
H  -0.555627 1.15588 1.438788
H  0.301417 1.810289 0.02605
H  -2.8841 0.108105 0.516925
H  6.242384 3.714627 -0.173798
H  -1.18921 3.003708 -1.828597
H  -2.603909 2.177804 2.193346
H  -3.035182 4.664605 -2.138253
H  -4.46392 3.827815 1.880188
H  -4.685554 5.079274 -0.288412
H  -3.998577 -3.605181 -1.739994
H  -4.161719 -1.053495 1.766846
H  -6.253696 -4.574005 -1.133004
H  -6.386715 -1.996867 2.36619
H  -7.447339 -3.757258 0.922961
