program: Gaussian 09
title: 000156267
version: EM64L-G09RevD.01
frameworkgroup: C1[X(C16H22N2OS)]
method: RPBEPBE
basis: SDD
operation: Freq
keyword: #p
keyword: freq=noraman
keyword: PBEPBE/SDD
title: #p freq=noraman PBEPBE/SDD
converged: YES YES NO NO
title: Mulliken charges:
elementType: S O N N C C C C C C C C C C C C C C C C H H H H H H H H H H H H H H H H H H H H H H
charge: 0.201082 -0.455300 -0.101245 -0.099470 -0.034688 -0.371160 -0.227702 -0.716764 -0.431492 0.470263 -0.708378 -0.709580 -0.193471 -0.405521 -0.405465 -0.243165 -0.155945 -0.157425 -0.209718 -0.333462 0.207881 0.218619 0.216886 0.225035 0.275622 0.273243 0.212757 0.253330 0.215797 0.205958 0.216888 0.207699 0.215467 0.217224 0.244270 0.267207 0.244161 0.242335 0.275857 0.254436 0.344690 0.253243
chargesum: 0.00000
title: Mulliken charges with hydrogens summed into heavy atoms:
elementType: S O N N C C C C C C C C C C C C C C C C
charge: 0.201082 -0.110610 -0.101245 -0.099470 0.173193 0.064345 -0.002667 -0.167899 0.034595 0.470263 -0.069736 -0.069188 -0.193471 -0.161251 -0.138258 0.000996 0.086390 0.118432 0.044718 -0.080219
polarizability: 2.88792279e+02 1.33584328e+01 1.92557038e+02 -1.58125928e+01 1.73637981e+01 1.42055385e+02
1716.lowfreq: -8.7766 -0.0019 -0.0017 -0.0011 2.9157 6.7281 10.5119 19.7770 28.8466
frequency: 9.1805 19.7316 28.6389 30.6309 48.8366 52.7453 82.0070 87.1413 91.4279 130.2754 152.3763 167.3320 199.8950 221.6084 235.7149 247.6368 271.1165 274.3943 301.7841 328.1751 339.3089 357.2958 364.4814 400.8097 405.5168 422.7117 486.0442 518.5340 542.1601 619.0475 628.3048 634.8712 653.0013 720.4622 724.2627 728.3063 737.4914 766.3367 771.3156 779.8503 787.7828 826.2766 838.4284 843.8244 879.2794 913.1595 941.2296 946.2514 953.9483 954.3078 969.5577 972.2666 982.0952 1003.8406 1006.2611 1008.9195 1027.6033 1053.5500 1072.4404 1088.3280 1106.6499 1120.6233 1126.3036 1150.2125 1155.1631 1192.0013 1197.4493 1198.7404 1216.7162 1221.6423 1247.1257 1263.9672 1281.7585 1290.1279 1302.3356 1312.4556 1328.5154 1335.3412 1336.9244 1353.3901 1358.3142 1368.3265 1379.4134 1395.9319 1398.4717 1408.5877 1438.6145 1454.1701 1461.2802 1465.5708 1468.0126 1478.4746 1478.7216 1484.1884 1488.6355 1490.5627 1574.1452 1611.5067 2962.6119 2963.3546 2970.2088 2973.5760 2983.8946 2997.2320 3016.5272 3034.0858 3062.5220 3068.0693 3070.3414 3072.4261 3077.7513 3096.0319 3125.0797 3146.8233 3148.6550 3167.6277 3223.5718 3226.8313 3255.6108 3558.5165
redmass: 5.5606 5.0154 3.5388 3.4716 4.5674 4.2376 3.1976 3.8186 5.4350 1.9766 4.6981 4.9825 4.5764 1.1841 1.5590 1.6266 1.1804 5.3906 5.4174 4.1288 2.7789 2.0526 2.3221 4.1313 3.6246 3.5942 5.5954 2.8423 2.6578 3.3286 5.1983 5.0169 3.4360 4.9491 3.6194 1.3094 4.0078 1.8124 2.5530 1.1847 3.0513 1.5064 1.2526 1.4056 6.2675 1.2018 1.2715 1.8064 1.7262 1.9364 1.6279 1.3920 6.3399 2.0649 3.4160 3.6814 3.5398 1.6542 3.5022 1.3612 1.8260 1.4686 1.7454 1.3517 1.4016 1.9273 1.1483 1.4065 1.6079 1.5981 1.2719 1.9083 1.2543 1.1391 1.3961 1.3956 1.8719 2.3222 1.4472 3.1141 1.3695 3.1878 1.2084 1.2224 2.4065 2.1851 1.7885 1.0942 1.7317 1.0447 1.0891 1.0546 2.7443 1.0542 2.3000 1.0607 6.7801 6.1362 1.0853 1.0777 1.0353 1.0365 1.0650 1.0625 1.0552 1.1024 1.0996 1.1002 1.0985 1.0990 1.1016 1.1088 1.0878 1.0870 1.0964 1.0958 1.0968 1.0918 1.1095 1.0663
irintensity: 0.1858 2.2364 0.8462 0.2127 0.3990 0.2841 5.2447 2.8707 0.5682 1.1561 2.1352 0.1765 0.9667 0.2501 1.6928 4.2216 136.3698 14.8860 6.5340 3.6070 1.4096 0.0263 0.2574 7.3004 1.3953 3.2403 17.2169 1.8907 23.7349 18.7637 2.3442 7.5139 18.2998 17.8515 5.0272 14.2065 8.6582 68.3198 25.3163 13.0314 1.2931 61.1716 0.0051 1.3177 10.4188 1.4656 1.1167 11.8979 2.2558 4.0174 0.0875 1.9322 73.0809 0.2093 35.6511 5.1111 5.0832 21.3361 56.6343 0.2100 13.3423 6.1337 0.1542 25.4132 51.4156 8.2539 7.6532 2.0817 23.7242 0.1467 5.2144 33.6762 5.4214 0.3118 8.9060 19.9272 0.2884 0.6952 2.6345 3.4649 0.1345 26.6711 22.5191 17.9873 27.7433 15.4939 20.5735 27.1266 15.8532 1.5207 1.8770 2.5389 18.3384 11.8072 62.7449 18.4024 2.1020 53.2464 34.2181 13.0837 38.1684 22.6709 33.5292 45.3416 17.3807 14.4463 14.8850 16.5478 98.7466 88.4294 15.0839 25.6661 11.2976 3.9855 12.2846 6.3590 2.9219 1.8858 2.1142 9.1366
temp: 298.150 k
press: 1.00000 atm
elementType: 16 8 7 7 6 6 6 6 6 6 6 6 6 6 6 6 6 6 6 6 1 1 1 1 1 1 1 1 1 1 1 1 1 1 1 1 1 1 1 1 1 1
symmnumber: 1
zpe: 913898.1 jmol-1
zpe.correction: 0.348085 hartree
zpe.thermalcorrener: 0.369363 hartree
zpe.thermalcorrenthalpy: 0.370307 hartree
zpe.thermalcorrgfe: 0.293466 hartree
zpe.sumelectzpe: -1204.155618 hartree
zpe.sumelectthermal: -1204.134340 hartree
zpe.sumelectthermalent: -1204.133396 hartree
zpe.sumelectthermalfe: -1204.210237 hartree
dipole: -2.5054 3.7028 1.6534
dipole: 4.7667
quadrupole: -124.6000 -131.2919 -129.7340
quadrupole: 24.8782 -4.2195 2.4683
quadrupole: 3.9420 -2.7499 -1.1921 24.8782 -4.2195 2.4683
hfenergy: -1204.5037035 hartree
pointgroup: C01 [X(C16H22N2O1S1)]
dipole: 0.8358677 0.2296432 -1.6630068 debye
polarizability: 289.325396|-18.9740408|139.7600107|-5.2340687|-13.0775943|194.3192949 unknown
InChI: InChI=1S/C16H22N2OS/c1-13(2)7-10-20-15-5-3-14(4-6-15)16(19)11-18-9-8-17-12-18/h3-6,8-9,12-13,16,19H,7,10-11H2,1-2H3
charge 0 multiplicity 1
42 atoms
S  2.58808 0.29804 1.536609
O  -2.955348 1.629456 -2.215243
N  -4.127888 -0.965736 0.278292
N  -5.234189 -1.479434 2.196628
C  6.200564 -0.604347 -0.507898
C  5.1507 -0.268998 0.594058
C  -3.075282 1.044543 -0.867079
C  3.721199 -0.058522 0.061438
C  -3.827568 -0.321743 -1.005864
C  -1.671495 0.894464 -0.30989
C  5.90602 -1.949538 -1.215511
C  6.366446 0.542213 -1.535089
C  0.948969 0.519445 0.746426
C  -1.432408 0.998367 1.082672
C  -0.582103 0.608134 -1.166342
C  -0.13896 0.811772 1.609497
C  0.717923 0.423379 -0.648071
C  -3.297582 -1.835725 1.001142
C  -5.281651 -0.781076 1.045371
C  -3.993349 -2.141159 2.172873
H  7.168268 -0.715222 0.025491
H  5.474009 0.646133 1.128881
H  5.141363 -1.090581 1.337774
H  -3.674599 1.702882 -0.202168
H  3.667194 0.803811 -0.623943
H  3.342142 -0.961357 -0.446061
H  -4.7869 -0.149508 -1.531758
H  -3.216417 -0.997161 -1.628988
H  6.735391 -2.223322 -1.893518
H  4.985778 -1.894753 -1.827353
H  5.780055 -2.76977 -0.484079
H  5.459836 0.664088 -2.157339
H  7.209729 0.334227 -2.219222
H  6.566399 1.507087 -1.032475
H  -2.259382 1.222646 1.766827
H  -0.750741 0.562748 -2.246919
H  0.025268 0.895966 2.689468
H  1.538236 0.214106 -1.340852
H  -2.319567 -2.135535 0.634683
H  -6.112117 -0.159166 0.71673
H  -3.855901 1.860382 -2.558174
H  -3.686124 -2.788733 2.990472
