program: Gaussian 09
title: 000156266
version: EM64L-G09RevD.01
frameworkgroup: C1[X(C18H36O2)]
method: RPBEPBE
basis: SDD
operation: Freq
keyword: #pfreq=noraman
keyword: PBEPBE/SDD
title: #p freq=noraman PBEPBE/SDD
converged: YES YES NO NO
title: Mulliken charges:
elementType: O O C C C C C C C C C C C C C C C C C C H H H H H H H H H H H H H H H H H H H H H H H H H H H H H H H H H H H H
charge: -0.257359 -0.247418 -0.019927 -0.401611 -0.423388 -0.366993 -0.390327 -0.380555 -0.368559 -0.358837 -0.375473 -0.405838 -0.355443 -0.515301 -0.346597 -0.717001 0.258176 -0.356993 -0.695968 -0.696523 0.236500 0.192751 0.211412 0.210235 0.211959 0.182378 0.196957 0.231933 0.229646 0.195468 0.187301 0.189490 0.187962 0.207256 0.190414 0.187265 0.190766 0.225773 0.208149 0.197675 0.197105 0.185532 0.187500 0.231191 0.230484 0.222409 0.220891 0.219238 0.195403 0.194136 0.209377 0.206919 0.215484 0.209479 0.215267 0.210233
chargesum: 0.00000
title: Mulliken charges with hydrogens summed into heavy atoms:
elementType: O O C C C C C C C C C C C C C C C C C C
charge: -0.257359 -0.247418 0.216573 0.002552 -0.001194 0.012342 0.071252 0.002214 0.008893 0.038833 0.002557 0.028084 0.039336 -0.053626 0.026434 -0.054464 0.258176 0.032546 -0.064188 -0.061545
polarizability: 2.30581397e+02 6.46718744e-01 2.11478784e+02 -2.29589666e+00 -1.56629982e+00 1.64928331e+02
1716.lowfreq: -16.2135 -6.8830 -4.6260 0.0002 0.0005 0.0008 17.3851 19.3250 26.1143
frequency: 4.5190 16.3415 25.9375 32.2610 35.2917 42.0721 53.0267 66.6183 67.6387 75.0960 84.1283 93.0572 104.6671 122.3981 128.9672 141.2874 142.4506 156.1636 199.7014 209.7078 219.5367 226.8149 235.4994 253.9826 259.2596 284.1942 291.8528 304.6978 339.9517 391.8901 404.2373 431.3022 445.0160 479.0335 488.2746 530.5972 617.2813 679.8352 721.1543 725.6166 726.6776 743.6744 757.2704 773.0699 779.0576 802.5123 828.0141 847.9589 881.8870 887.3610 890.9780 895.7883 913.7916 932.3270 947.1622 979.7287 994.2760 997.5903 1008.4304 1011.4072 1026.9598 1033.8364 1035.9192 1046.9943 1071.7454 1078.1858 1079.7513 1080.7858 1089.7745 1097.6092 1117.4657 1127.0397 1140.5882 1151.4689 1167.2243 1186.4828 1206.6684 1210.0369 1221.7590 1234.8036 1238.9099 1256.9185 1265.7704 1269.0308 1270.5688 1272.9320 1281.1811 1283.3587 1290.2335 1292.1088 1295.7010 1301.8079 1305.6757 1324.0724 1326.0217 1330.1246 1344.8709 1348.6639 1351.2009 1354.2782 1357.2206 1363.0484 1370.0832 1386.5342 1388.4616 1388.8688 1449.0797 1451.5961 1458.4551 1460.0533 1461.9808 1464.6337 1465.3689 1466.0985 1471.5814 1474.3077 1474.6793 1476.2077 1476.6345 1478.2759 1483.7876 1485.4360 1488.1407 1488.9822 1490.5240 1634.6772 2946.7755 2948.6966 2951.2237 2952.7006 2956.8445 2961.2870 2962.5841 2967.0766 2967.6716 2969.0653 2971.5224 2973.9271 2981.5289 2981.7761 2982.8158 2987.2212 2988.5165 2995.3965 2998.4799 3010.6451 3013.0401 3014.6818 3015.9464 3024.7989 3028.5109 3036.4871 3036.7433 3049.7338 3064.5339 3067.8675 3069.8813 3070.5313 3073.5802 3077.4465 3085.6678 3098.1845
redmass: 2.9424 2.4136 2.1114 3.7399 3.2263 3.3223 3.9211 3.7256 1.6773 3.2800 1.8301 2.5703 2.8479 3.0573 1.8317 2.7382 2.2359 2.4075 2.8224 2.2100 1.2174 1.1217 1.9578 2.1604 3.1240 2.9314 2.1632 2.7660 2.6415 3.0032 2.8215 2.8720 3.2644 2.8848 2.8120 2.5625 4.2346 2.6818 1.0654 1.1031 1.1062 1.2434 1.2427 1.7659 1.3488 1.7210 2.0059 1.5772 1.5615 1.9323 1.8745 2.0256 2.1919 1.4916 1.5387 2.3254 2.2030 4.2377 1.7165 1.2377 1.4816 2.9192 2.8475 3.0299 2.2804 2.3822 2.1174 2.3139 2.0225 1.8166 2.1209 2.0265 2.5599 2.5979 1.9610 1.7660 1.3952 1.4386 1.4470 1.3313 1.2535 1.3078 1.2811 1.2524 1.2666 1.1370 1.0496 1.1741 1.0750 1.0624 1.1877 1.2218 1.2658 1.3555 1.3322 1.4102 1.4157 1.5338 1.6744 1.4630 1.5771 1.5979 1.3437 1.2206 1.2192 1.2157 1.0927 1.1078 1.0753 1.0700 1.0677 1.0693 1.0818 1.0742 1.0796 1.0471 1.0584 1.0643 1.0436 1.0806 1.0840 1.0750 1.0879 1.0610 1.0721 9.1139 1.0586 1.0585 1.0609 1.0591 1.0592 1.0616 1.0592 1.0587 1.0627 1.0370 1.0365 1.0643 1.0932 1.0396 1.0621 1.0732 1.0977 1.0951 1.0998 1.0878 1.0758 1.0924 1.0670 1.1034 1.0985 1.1029 1.1038 1.1038 1.1005 1.1007 1.0994 1.0993 1.0990 1.0999 1.1023 1.1059
irintensity: 0.0296 0.0006 0.0267 0.4491 0.0701 0.1573 0.5355 0.8805 0.1217 0.9686 0.1691 0.0163 0.3310 0.8031 0.0289 0.1680 0.1060 0.2250 0.7063 2.0683 0.2804 0.0008 0.6743 0.3749 1.7670 0.5666 0.1383 9.3467 2.7623 0.0409 2.4570 1.8415 0.4986 0.1364 1.4374 7.9071 3.1296 4.6853 11.3046 10.4950 5.2155 6.9668 9.7166 4.1735 1.8339 4.8283 1.7382 2.7041 0.9818 4.7713 3.4755 7.1977 17.8658 2.7542 9.8385 21.4388 14.6635 1.1280 12.9834 4.7650 0.7034 1.4010 30.2694 13.9484 9.3029 0.4135 1.3619 1.7508 8.3029 64.4530 6.1929 4.0574 140.5365 2.1800 0.3799 3.2333 25.5503 10.2160 3.7152 10.5417 23.1056 3.8292 1.1783 1.8520 3.1075 1.6811 0.7202 2.5216 0.7674 0.2127 0.8160 0.1834 1.3115 17.9144 1.5779 12.1992 5.7582 1.7261 0.1087 1.5434 0.3941 1.4792 2.0193 13.7348 19.2827 9.6856 15.1362 13.7627 1.1787 0.8426 1.2313 3.8133 2.0997 2.6765 1.8193 11.9637 5.3788 15.3689 10.9607 2.7862 9.7243 15.6199 27.3820 12.2775 6.9787 146.1581 1.1568 3.2651 4.2573 1.4280 10.3216 1.9081 50.2283 138.6366 95.7479 31.9266 34.9656 3.7871 0.3889 56.4194 62.7217 31.5616 3.2560 4.6176 2.4110 10.0537 12.2130 6.2769 27.1765 0.7208 23.4969 146.5385 43.1439 110.5561 118.2540 86.4112 66.3519 45.6733 42.7033 65.2182 21.6294 17.8748
temp: 298.150 k
press: 1.00000 atm
elementType: 8 8 6 6 6 6 6 6 6 6 6 6 6 6 6 6 6 6 6 6 1 1 1 1 1 1 1 1 1 1 1 1 1 1 1 1 1 1 1 1 1 1 1 1 1 1 1 1 1 1 1 1 1 1 1 1
symmnumber: 1
zpe: 1329511.4 jmol-1
zpe.correction: 0.506384 hartree
zpe.thermalcorrener: 0.532996 hartree
zpe.thermalcorrenthalpy: 0.533940 hartree
zpe.thermalcorrgfe: 0.443449 hartree
zpe.sumelectzpe: -856.304376 hartree
zpe.sumelectthermal: -856.277764 hartree
zpe.sumelectthermalent: -856.276820 hartree
zpe.sumelectthermalfe: -856.367311 hartree
dipole: 0.8268 0.7799 -1.3243
dipole: 1.7452
quadrupole: -130.7432 -124.4978 -132.2550
quadrupole: -7.7791 4.3056 5.2053
quadrupole: -1.5779 4.6676 -3.0896 -7.7791 4.3056 5.2053
hfenergy: -856.8107603 hartree
pointgroup: C01 [X(C18H36O2)]
dipole: -0.3147214 0.3282983 0.5143849 debye
polarizability: 230.4956032|-0.9897502|211.5556121|-3.0340752|0.0838473|164.9372964 unknown
InChI: InChI=1S/C18H36O2/c1-4-7-9-10-11-12-13-15-18(19)20-16-17(6-3)14-8-5-2/h17H,4-16H2,1-3H3
charge 0 multiplicity 1
56 atoms
O  3.145327 -1.062055 0.876671
O  3.205231 -2.123285 -1.202788
C  2.852617 1.064261 -0.425015
C  1.820918 1.656016 0.571754
C  3.632472 2.136627 -1.243241
C  0.615096 2.345028 -0.107222
C  3.846484 0.119761 0.283238
C  -1.675092 -2.204682 -0.046902
C  -2.535269 -0.965845 0.291635
C  -0.225041 -2.086487 0.471602
C  -3.97954 -1.047533 -0.251053
C  0.638487 -3.327722 0.154957
C  -0.467774 2.797991 0.899423
C  2.089247 -3.222299 0.704852
C  -4.83573 0.187827 0.109082
C  4.533362 3.08343 -0.415483
C  2.864576 -2.120367 0.004233
C  -6.276731 0.120245 -0.446114
C  -1.681253 3.466333 0.217691
C  -7.123589 1.356854 -0.074707
H  2.299851 0.446145 -1.162852
H  2.32316 2.374554 1.25201
H  1.445194 0.834767 1.214611
H  4.254542 1.614507 -1.998153
H  2.902986 2.7406 -1.816434
H  0.159181 1.643239 -0.838321
H  0.953637 3.224866 -0.691254
H  4.610852 -0.247138 -0.426218
H  4.325453 0.594161 1.15545
H  -1.661346 -2.353949 -1.146727
H  -2.149664 -3.1110 0.384636
H  -2.565087 -0.832218 1.393641
H  -2.043431 -0.057187 -0.116714
H  0.243234 -1.183808 0.028132
H  -0.237725 -1.920591 1.569095
H  -4.469609 -1.961352 0.146013
H  -3.95084 -1.165314 -1.354641
H  0.681587 -3.490418 -0.939586
H  0.165733 -4.227357 0.596416
H  -0.808863 1.918967 1.483941
H  -0.016515 3.500584 1.629727
H  -4.339181 1.104193 -0.275361
H  -4.874497 0.29796 1.213328
H  2.619005 -4.174979 0.518296
H  2.077302 -3.031336 1.791187
H  5.331765 2.532666 0.114983
H  3.953972 3.646914 0.338526
H  5.025253 3.821803 -1.074649
H  -6.237069 0.01474 -1.549632
H  -6.770833 -0.796587 -0.064156
H  -1.371229 4.357096 -0.360908
H  -2.174223 2.766158 -0.483794
H  -2.43631 3.788817 0.958098
H  -7.202111 1.467142 1.023555
H  -8.149188 1.28459 -0.481387
H  -6.666883 2.283369 -0.471572
