program: Gaussian 09
title: 000156262
version: EM64L-G09RevD.01
frameworkgroup: C1[X(C16H9Cl)]
method: RPBEPBE
basis: SDD
operation: Freq
keyword: #pfreq=noraman
keyword: PBEPBE/SDD
title: #p freq=noraman PBEPBE/SDD
converged: NO NO NO YES
title: Mulliken charges:
elementType: Cl C C C C C C C C C C C C C C C C H H H H H H H H H
charge: -0.050136 0.018549 -0.015248 0.646674 0.510718 0.466992 0.485615 -0.442485 -0.533596 -0.478925 -0.480381 -0.448977 -0.467538 -0.474510 -0.460704 -0.233532 -0.239584 0.260437 0.238409 0.238512 0.264958 0.244118 0.247646 0.242994 0.230242 0.229753
chargesum: 0.00000
title: Mulliken charges with hydrogens summed into heavy atoms:
elementType: Cl C C C C C C C C C C C C C C C C
charge: -0.050136 0.018549 -0.015248 0.646674 0.510718 0.466992 0.485615 -0.442485 -0.273159 -0.240517 -0.241869 -0.184018 -0.223420 -0.226863 -0.217710 -0.003290 -0.009832
polarizability: 2.73151388e+02 -3.03965163e+01 2.40631445e+02 1.29901600e-03 4.29985032e-04 6.64804706e+01
1716.lowfreq: -11.5517 0.0018 0.0024 0.0030 8.7677 9.2152 77.7899 117.4984 161.4581
frequency: 77.7713 117.4964 161.4573 199.8926 233.3210 258.6176 302.9088 303.3297 363.1483 413.0250 414.6974 474.4250 491.7276 494.0400 512.3175 540.4807 562.7800 573.5422 590.0711 624.2201 691.9689 699.0245 730.0140 749.3079 780.8925 785.1176 801.7061 847.5129 847.8466 863.9686 892.1292 922.0619 928.7161 978.6128 979.8373 987.1042 988.7546 993.7343 1070.3011 1096.4434 1113.5748 1160.8684 1181.6812 1188.0238 1218.6425 1229.7186 1247.6403 1262.7232 1321.6451 1366.1517 1382.0511 1418.3390 1427.9956 1430.2467 1431.9454 1449.2204 1492.0262 1497.2446 1556.7708 1593.4764 1603.5451 1605.0902 1634.8634 3121.0142 3125.1108 3128.0466 3135.1681 3145.8288 3148.2975 3154.7601 3158.1829 3168.5721
redmass: 6.3390 5.4314 4.3011 11.7584 3.7660 4.1432 4.9718 11.1872 5.3049 7.9787 3.9361 7.0607 3.5249 4.7107 3.5568 6.1916 6.4570 3.4747 3.7759 6.7787 3.6338 6.6114 2.2555 5.5907 1.3644 1.4177 6.1254 5.7050 1.8738 2.4897 1.5790 1.5153 1.4977 4.6937 1.3491 1.3748 7.5316 1.4001 2.1874 1.7306 2.2366 1.3035 1.2202 1.2434 1.8197 1.8561 1.5342 2.5914 3.1043 2.3312 3.4893 2.7954 2.8493 5.3688 2.9823 5.8195 5.2988 3.8102 4.6412 7.9824 6.4580 6.7291 7.8339 1.0863 1.0861 1.0872 1.0919 1.0980 1.0927 1.0929 1.0988 1.0972
irintensity: 0.1706 1.4775 1.4692 0.3806 6.6494 0.8016 1.6544 3.8199 0.9726 0.6038 0.0820 1.5569 1.1267 1.2985 0.0785 3.6864 4.6232 0.3385 1.1901 6.2102 1.9911 4.1614 54.0162 16.0125 10.6550 4.1757 7.2174 30.9872 11.5420 66.7594 63.8376 8.8593 0.1553 15.2918 0.3236 5.1834 1.2984 0.0498 0.1556 11.5634 19.3475 4.5022 3.7593 8.7818 1.8260 17.9713 1.5771 10.4610 2.1465 3.0960 20.0597 8.4604 1.4647 0.2345 1.5878 27.0396 1.8216 1.2192 4.5884 6.3008 8.6117 19.2295 3.3160 1.4919 0.3403 4.6382 11.6003 26.1614 29.2506 4.5180 35.2495 12.7637
temp: 298.150 k
press: 1.00000 atm
elementType: 17 6 6 6 6 6 6 6 6 6 6 6 6 6 6 6 6 1 1 1 1 1 1 1 1 1
symmnumber: 1
zpe: 511061.4 jmol-1
zpe.correction: 0.194653 hartree
zpe.thermalcorrener: 0.206176 hartree
zpe.thermalcorrenthalpy: 0.207120 hartree
zpe.thermalcorrgfe: 0.157152 hartree
zpe.sumelectzpe: -1074.096112 hartree
zpe.sumelectthermal: -1074.084589 hartree
zpe.sumelectthermalent: -1074.083645 hartree
zpe.sumelectthermalfe: -1074.133613 hartree
dipole: 1.9882 0.9911 0.0000
dipole: 2.2215
quadrupole: -95.1763 -88.9949 -111.1930
quadrupole: -4.8570 0.0001 0.0001
quadrupole: 3.2785 9.4598 -12.7383 -4.8570 0.0001 0.0001
hfenergy: -1074.2907649 hartree
pointgroup: C01 [X(C16H9Cl1)]
dipole: 0.5324207 0.6931323 0.000015 debye
dipolederiv: -0.4568715 -0.3947468 -0.0000019 -0.3860062 -0.5685805 -0.0000027 0.000005 0.0000041 -0.0656788 0.079006 0.0649974 0.0000009 -0.0609482 -0.072248 -0.0000001 0.0000014 -0.0000041 -0.0343619 -0.0145971 -0.0542439 -0.0000002 -0.0310781 -0.1004554 -0.0000011 -0.000001 0.0000005 -0.0456277 -0.157969 -0.2586686 -0.000003 -0.2008429 -0.1680207 -0.000001 0.0000027 0.0000009 0.0927859 0.1013882 0.1251073 0.0000015 0.1666422 -0.0030026 0.0000004 0.0000021 -0.000002 0.0762804 0.0593717 0.0772713 0.0000009 0.1204441 -0.1072396 -0.0000004 0.0000002 -0.0000002 0.0836313 -0.0457994 -0.1156856 -0.0000017 -0.1172851 0.0519289 -0.0000008 -0.0000044 -0.0000006 0.0860562 0.6281608 0.6262384 0.0000016 0.5222602 0.8778046 0.0000023 -0.0000143 -0.0000051 -0.1028566 -0.1912173 -0.1632894 0.0000016 -0.0534202 -0.1005979 0.0000017 0.0000047 0.0000051 -0.1235667 0.0006726 -0.0170297 0.0000006 0.0408874 0.1288857 0.0000029 0.0000006 0.000002 -0.1767726 0.0276262 0.0920416 0.000003 0.0179096 0.1150974 0.0000037 0.0000042 0.0000059 -0.1784714 -0.1133625 0.0554195 0.0000007 0.0638254 0.0110314 0.0000024 0.0000061 0.0000021 -0.1730477 -0.1230526 -0.0171445 -0.0000006 -0.016637 0.1120611 0.0000007 -0.0000002 0.0000014 -0.1884422 -0.1318411 -0.0462106 0.0000004 -0.0345123 0.0586244 0.0000016 -0.000003 0.0000026 -0.1935963 -0.0722036 0.1029537 0.0000029 0.1026467 0.0082802 0.0000025 0.0000069 0.0000032 -0.1916335 0.2033925 -0.0660833 -0.0000007 -0.0642207 -0.0403194 0.0000009 -0.0000041 0.0000014 -0.1423164 0.1811469 -0.0557571 0.0000019 -0.0687747 -0.012798 -0.0000004 0.0000008 0. -0.1466367 0.0736157 0.0630972 -0.0000006 0.0045352 -0.0339671 -0.0000013 0.0000002 -0.0000005 0.1601547 0.0579368 0.0904999 0.0000002 0.0131223 -0.1019159 -0.0000019 -0.0000002 -0.0000017 0.1537952 -0.0274112 -0.1341203 -0.000003 -0.0589051 -0.0153952 -0.0000023 -0.0000029 -0.0000041 0.1543142 0.0384691 -0.0494961 -0.0000006 -0.0895997 0.0385169 -0.0000016 -0.0000022 -0.0000024 0.1624768 0.0806419 0.0113284 -0.0000002 0.0709964 -0.1059814 -0.0000011 0.0000011 -0.0000023 0.1578856 0.0790542 0.0105447 -0.0000004 0.0718192 -0.0958798 -0.0000013 0.0000016 -0.0000033 0.1592691 -0.005815 -0.070101 -0.0000022 -0.1313299 -0.0235998 -0.0000028 -0.0000041 -0.000003 0.1585058 -0.1297836 0.0658352 0.0000005 0.0578008 0.071057 -0.0000003 0.0000007 -0.0000003 0.1572553 -0.1405584 0.0572423 -0.0000017 0.0606705 0.0767138 0. -0.0000021 0.0000005 0.1605981 unknown
polarizability: 290.8495999|-5.9309913|222.933233|0.0009795|0.0009555|66.4804706 unknown
InChI: InChI=1S/C16H9Cl/c17-14-9-12-5-1-3-10-7-8-11-4-2-6-13(14)16(11)15(10)12/h1-9H
charge 0 multiplicity 1
26 atoms
Cl -2.40647 -3.332397 -0.000027
C  -0.550153 0.384302 -0.000005
C  0.840089 0.019475 -0.000001
C  -1.583566 -0.629258 -0.000017
C  1.221004 -1.371447 -0.000004
C  -0.925296 1.779225 0.000008
C  1.861391 1.039137 0.000014
C  -1.143702 -2.010967 -0.000032
C  0.184259 -2.379593 -0.00002
C  0.119864 2.782265 0.00002
C  1.456142 2.428978 0.000025
C  -2.947213 -0.233988 -0.00001
C  -2.301523 2.131214 0.000004
C  2.599235 -1.718256 0.000006
C  3.228736 0.650767 0.000023
C  -3.296775 1.132813 -0.000001
C  3.589793 -0.713353 0.000017
H  0.467326 -3.436952 -0.000023
H  -0.176265 3.837956 0.000027
H  2.235824 3.199706 0.000042
H  -3.724565 -1.003541 -0.00002
H  -2.582412 3.190835 0.000008
H  2.886682 -2.775842 0.0000
H  4.004235 1.425542 0.000039
H  -4.354153 1.418632 0.000002
H  4.648212 -0.995552 0.000023
