program: Gaussian 09
title: 000156256
version: EM64L-G09RevD.01
frameworkgroup: C1[X(C15H31N)]
method: RPBEPBE
basis: SDD
operation: Freq
keyword: #pfreq=noraman
keyword: PBEPBE/SDD
title: #p freq=noraman PBEPBE/SDD
converged: YES YES NO NO
title: Mulliken charges:
elementType: N C C C C C C C C C C C C C C C H H H H H H H H H H H H H H H H H H H H H H H H H H H H H H H
charge: -0.340035 -0.088529 -0.102634 -0.479551 -0.479384 -0.465886 -0.404716 -0.372536 -0.351270 -0.379968 -0.374754 -0.358333 -0.353167 -0.698328 -0.356639 -0.696837 0.215484 0.207327 0.205455 0.218445 0.217091 0.218159 0.242588 0.192699 0.207841 0.191979 0.202809 0.216977 0.192655 0.171484 0.223079 0.190647 0.188971 0.191596 0.190368 0.197232 0.189379 0.187187 0.187096 0.207792 0.211530 0.212673 0.195066 0.195175 0.209398 0.214963 0.209423
chargesum: 0.00000
title: Mulliken charges with hydrogens summed into heavy atoms:
elementType: N C C C C C C C C C C C C C C C
charge: -0.097447 0.126954 0.104693 -0.055651 -0.044134 -0.065346 -0.009927 0.037096 0.043293 -0.000350 0.007210 0.028278 0.021115 -0.066334 0.033601 -0.063053
polarizability: 1.99250005e+02 -1.09981145e+00 1.70777345e+02 -1.06269719e+00 8.86001488e-01 1.38684506e+02
1716.lowfreq: -9.3224 -5.8611 -0.0009 -0.0003 0.0006 8.6996 15.6492 29.4135 35.5064
frequency: 14.8479 29.0566 35.2401 45.4376 55.0700 71.7938 78.1771 94.4466 97.8838 126.2971 128.0433 140.7195 148.0083 186.6195 204.3366 227.0898 232.4784 242.2108 279.0326 288.6803 361.0309 399.7814 430.4086 462.0253 463.2414 486.1329 585.2993 629.7365 663.4167 720.8814 728.1871 730.3908 757.1199 787.5190 813.6638 840.8378 859.0745 882.3489 887.6030 897.6249 898.2887 921.0980 949.1377 976.0060 986.0993 1002.7088 1013.6808 1020.5439 1029.8978 1045.5537 1057.7989 1074.5553 1076.9880 1081.4808 1087.1552 1098.9014 1113.4104 1123.3606 1128.3537 1135.4001 1178.7394 1183.0156 1195.7763 1214.9292 1221.4827 1233.2732 1238.7118 1259.6220 1265.8768 1273.5418 1277.8331 1279.5083 1282.3101 1287.6657 1289.7974 1292.0060 1302.4830 1304.7919 1314.4357 1328.3863 1331.4938 1345.7728 1351.8786 1353.7509 1354.2330 1360.0551 1388.6687 1389.6613 1418.8977 1448.1392 1454.2447 1460.3031 1460.8487 1462.8541 1467.3836 1468.3804 1473.4547 1475.9778 1476.1005 1477.1105 1477.4010 1483.4430 1487.2802 1488.1993 2937.9664 2947.0872 2948.9046 2949.2292 2950.1841 2952.0227 2956.9687 2957.7606 2963.4359 2967.0319 2969.9359 2969.9692 2971.1818 2978.4751 2982.9489 2992.4724 2993.0626 2999.1129 3001.6954 3010.9389 3013.4268 3031.3315 3035.8194 3043.9914 3051.3107 3066.2234 3067.0805 3067.6214 3068.1556 3069.9965 3412.0130
redmass: 3.7071 2.6879 2.6091 1.8349 2.2421 2.7848 2.1193 2.6953 1.7304 2.3647 2.9291 1.9668 2.0663 2.3191 3.9361 1.1613 1.1134 2.3105 2.8772 3.3882 2.8551 3.3046 2.7159 1.8918 2.3668 2.4021 2.4793 3.8373 1.8151 1.0624 1.0889 1.0933 1.1521 1.2430 1.2901 2.3048 1.7179 1.8989 1.8344 1.8159 1.4342 1.4290 1.7024 1.5987 3.5103 2.0021 1.6635 2.6636 2.2541 2.8114 2.1315 2.0695 2.5022 2.1241 1.8182 2.1203 2.0670 1.8722 2.1121 3.1127 1.5569 1.7351 1.6302 1.4660 1.3107 1.3753 1.2997 1.3074 1.2484 1.2878 1.2022 1.1647 1.1314 1.1380 1.1239 1.0975 1.2806 1.3272 1.1965 1.3783 1.4473 1.4260 1.4957 1.6628 1.6527 1.5799 1.2179 1.2166 1.2206 1.0858 1.0871 1.0806 1.0754 1.0734 1.0677 1.0769 1.0967 1.0532 1.0752 1.0609 1.0446 1.0847 1.0801 1.0905 1.0720 1.0622 1.0635 1.0659 1.0590 1.0626 1.0592 1.0841 1.0608 1.0590 1.0365 1.0606 1.0373 1.0613 1.0958 1.0980 1.0645 1.0936 1.0978 1.1007 1.1030 1.1041 1.1032 1.1035 1.0992 1.1006 1.1030 1.1007 1.0995 1.0992 1.0752
irintensity: 0.1165 0.1869 0.1454 0.2455 0.4643 0.1835 0.2877 0.2749 0.2330 0.1588 0.1794 0.1406 0.3751 0.3413 0.0889 0.1232 0.0009 0.6241 0.4670 0.0545 0.8405 0.3233 3.4482 9.9534 1.5055 3.9739 1.8965 31.3431 37.0874 14.3600 0.0489 10.9811 4.2095 0.8562 0.9323 3.4113 6.9159 3.7715 3.1737 2.6490 2.9127 4.7631 5.6767 2.6806 2.1755 2.9594 2.5609 3.4139 4.5822 0.5573 4.2122 1.9450 0.2175 2.0329 0.5917 29.7160 22.4813 8.9677 5.9190 15.6473 3.8259 1.8736 0.0038 0.6206 7.4575 0.4466 0.9264 0.5425 0.0946 0.6537 0.0735 0.6558 1.2794 1.9384 0.3291 0.6363 3.0137 3.4569 6.2389 0.0273 0.9127 6.7529 9.9004 1.4128 0.3191 2.0959 11.2935 11.2838 14.8773 4.0439 0.9080 3.6041 1.2704 3.0153 0.1083 1.4108 5.6564 7.3301 4.2881 7.0526 11.8134 3.3427 13.9220 27.3606 8.2582 6.2766 23.4547 5.2800 2.3545 20.1804 24.6723 26.4231 83.8470 38.7185 39.4326 120.8386 31.6081 69.0907 2.8755 3.5072 37.3464 14.2967 10.0906 6.7947 0.8716 18.0059 63.0427 126.3437 60.7558 49.6147 95.3373 112.0222 61.9809 55.2240 1.5283
temp: 298.150 k
press: 1.00000 atm
elementType: 7 6 6 6 6 6 6 6 6 6 6 6 6 6 6 6 1 1 1 1 1 1 1 1 1 1 1 1 1 1 1 1 1 1 1 1 1 1 1 1 1 1 1 1 1 1 1
symmnumber: 1
zpe: 1135491.1 jmol-1
zpe.correction: 0.432486 hartree
zpe.thermalcorrener: 0.452968 hartree
zpe.thermalcorrenthalpy: 0.453913 hartree
zpe.thermalcorrgfe: 0.379808 hartree
zpe.sumelectzpe: -643.598397 hartree
zpe.sumelectthermal: -643.577914 hartree
zpe.sumelectthermalent: -643.576970 hartree
zpe.sumelectthermalfe: -643.651075 hartree
dipole: -0.1339 -1.2462 0.5642
dipole: 1.3745
quadrupole: -105.8300 -104.6148 -101.1717
quadrupole: -2.4371 1.7636 0.0311
quadrupole: -1.9578 -0.7426 2.7004 -2.4371 1.7636 0.0311
hfenergy: -644.0308824 hartree
pointgroup: C01 [X(C15H31N1)]
dipole: 0.0440229 0.4920448 0.2200065 debye
polarizability: 199.2853668|-0.5685682|170.7392882|0.9515489|-0.9866518|138.687201 unknown
InChI: InChI=1S/C15H31N/c1-3-5-7-8-9-11-15-13-12-14(16-15)10-6-4-2/h14-16H,3-13H2,1-2H3
charge 0 multiplicity 1
47 atoms
N  -1.608746 0.588942 0.45635
C  -0.946007 1.67896 -0.330557
C  -3.0847 0.883167 0.520138
C  -1.833191 2.931929 -0.083388
C  -3.261494 2.333875 -0.056301
C  0.536244 1.847749 0.049222
C  -3.913515 -0.162793 -0.260436
C  1.41834 0.627516 -0.302964
C  -3.8600 -1.572335 0.3633
C  2.895557 0.808715 0.110647
C  3.785047 -0.398957 -0.262585
C  -4.626543 -2.633889 -0.457519
C  5.262151 -0.227476 0.15733
C  -4.588809 -4.036291 0.187981
C  6.150733 -1.434016 -0.223442
C  7.623999 -1.257399 0.203368
H  -1.006624 1.413317 -1.407945
H  -3.409364 0.854563 1.581931
H  -1.57204 3.379118 0.896892
H  -1.708015 3.708479 -0.860081
H  -3.666983 2.276373 -1.085176
H  -3.967013 2.934819 0.543936
H  -1.195656 0.534578 1.399396
H  0.605121 2.058486 1.139367
H  0.933325 2.74632 -0.465622
H  -4.967687 0.18406 -0.317936
H  -3.530065 -0.203739 -1.300646
H  1.002378 -0.27922 0.178504
H  1.361979 0.446301 -1.396465
H  -4.277367 -1.537359 1.39302
H  -2.796376 -1.86794 0.459347
H  2.952851 0.979265 1.206623
H  3.30356 1.724797 -0.366891
H  3.373781 -1.315768 0.209652
H  3.732597 -0.565703 -1.359025
H  -4.194968 -2.6829 -1.478182
H  -5.681234 -2.311746 -0.581843
H  5.673869 0.691257 -0.311196
H  5.316536 -0.066704 1.254734
H  -5.045986 -4.019865 1.195716
H  -3.546877 -4.39156 0.299574
H  -5.136941 -4.779939 -0.419901
H  6.098313 -1.592083 -1.320173
H  5.736438 -2.351808 0.242043
H  8.069316 -0.362606 -0.271541
H  8.237569 -2.131974 -0.081743
H  7.706395 -1.129817 1.299489
