program: Gaussian 09
title: 000014119
version: EM64L-G09RevD.01
frameworkgroup: C1[X(C10H9NO2S)]
method: RPBEPBE
basis: SDD
operation: Freq
keyword: #p
keyword: freq=noraman
keyword: PBEPBE/SDD
title: #p freq=noraman PBEPBE/SDD
converged: YES YES NO NO
title: Mulliken charges:
elementType: S O O N C C C C C C C C C C H H H H H H H H H
charge: 0.253264 -0.349908 -0.245336 -0.370839 0.474755 -0.410494 0.303385 -0.195818 -0.291712 -0.386901 -0.210939 -0.544491 0.263278 -0.602870 0.255957 0.245796 0.248962 0.231142 0.263615 0.334208 0.232607 0.230079 0.272260
chargesum: 0.00000
title: Mulliken charges with hydrogens summed into heavy atoms:
elementType: S O O N C C C C C C C C C C
charge: 0.253264 -0.349908 -0.245336 -0.036630 0.474755 -0.410494 0.303385 0.060139 -0.045916 -0.137939 0.020203 -0.280876 0.263278 0.132075
polarizability: 1.79730812e+02 2.59997979e+00 1.57995082e+02 -1.35438543e+01 3.14569290e+00 7.04571494e+01
1716.lowfreq: -7.0876 -5.2435 0.0006 0.0011 0.0023 1.3689 34.1697 41.3957 67.3157
frequency: 34.1280 41.3643 67.3142 100.2158 152.4660 157.6523 196.2615 231.1812 261.1327 277.6895 341.6194 378.4850 446.7661 504.9409 531.7301 543.3198 560.5556 586.5390 628.7657 662.7537 671.0350 685.0079 702.1507 739.5139 762.5888 795.0343 838.6945 857.7881 884.7064 899.2130 908.9005 965.3328 1054.7952 1066.8732 1095.0685 1125.9572 1128.4943 1148.8476 1167.7360 1190.5714 1224.2842 1232.6493 1314.2508 1387.4361 1425.4358 1432.4056 1447.4938 1461.7894 1483.3955 1512.8990 1515.4247 1575.3263 1605.5566 1708.5316 2981.0669 3059.6134 3113.0980 3142.6840 3160.9720 3175.7084 3194.5787 3236.8413 3575.5995
redmass: 5.5363 4.7707 5.9044 1.1144 3.7915 4.4110 4.7781 4.8204 5.6299 6.0970 4.8810 8.5375 4.1558 7.4746 6.5576 6.0454 3.1243 1.1206 7.1653 5.3765 7.5722 8.5792 1.6969 6.3541 1.4161 2.3732 4.6043 4.1225 1.3405 1.5457 4.3420 1.3385 1.9438 5.7905 1.1364 1.5663 2.3781 1.6632 1.3085 1.9203 1.7292 2.1158 2.1550 4.1918 3.5668 1.1593 2.8555 1.4830 1.0470 1.6145 3.5183 6.7899 8.2231 9.6895 1.0354 1.1026 1.0985 1.0865 1.0931 1.0986 1.0905 1.1012 1.0773
irintensity: 5.5689 1.5905 2.4599 0.1455 3.7950 2.0497 2.8086 3.0077 2.8026 2.9284 19.9343 1.9979 2.2968 2.2356 0.8954 1.6367 5.5406 127.7856 4.2634 3.6198 0.4435 25.0730 15.0162 8.3391 123.9908 1.5708 25.3951 11.7708 1.2588 7.9372 88.6706 2.7941 7.3830 225.3655 5.2206 79.7343 174.9677 18.6963 97.2575 182.7375 5.8053 11.5028 12.7990 8.1955 61.2791 27.2141 149.9601 58.8982 16.2912 132.2916 12.5863 6.0944 8.8711 293.1945 81.7880 34.1805 4.2121 3.2681 10.6817 12.5758 1.8931 1.2075 45.3485
temp: 298.150 k
press: 1.00000 atm
elementType: 16 8 8 7 6 6 6 6 6 6 6 6 6 6 1 1 1 1 1 1 1 1 1
symmnumber: 1
zpe: 444772.9 jmol-1
zpe.correction: 0.169405 hartree
zpe.thermalcorrener: 0.182212 hartree
zpe.thermalcorrenthalpy: 0.183156 hartree
zpe.thermalcorrgfe: 0.128618 hartree
zpe.sumelectzpe: -988.732886 hartree
zpe.sumelectthermal: -988.720079 hartree
zpe.sumelectthermalent: -988.719135 hartree
zpe.sumelectthermalfe: -988.773672 hartree
dipole: 2.6123 0.3530 -2.0567
dipole: 3.3434
quadrupole: -67.8233 -77.4756 -95.1539
quadrupole: -2.9444 -6.8816 2.8220
quadrupole: 12.3276 2.6753 -15.0030 -2.9444 -6.8816 2.8220
hfenergy: -988.9022907 hartree
pointgroup: C01 [X(C10H9N1O2S1)]
dipole: 1.0675866 -0.0991424 0.7620596 debye
dipolederiv: -0.293976 0.1356736 -0.0370895 -0.0457863 -0.2133208 -0.025538 -0.0554437 0.00795 0.0873347 -1.9281681 -0.3421838 0.2341175 -0.769963 -0.4901483 0.197901 0.4033042 0.2062113 -0.5260104 -0.7758647 -0.0276662 -0.1386983 -0.0701119 -0.3878415 0.2189096 -0.0299319 0.1839348 -0.8842744 -1.4732294 -0.1246426 -0.1165485 -0.2219584 -0.4739244 -0.0781737 -0.1740513 -0.0894568 -0.4369216 -0.4354249 0.0970093 -0.0241842 -0.0711123 0.0789696 0.013223 -0.1123362 -0.0016948 0.0423318 0.1559352 -0.3465742 0.0107178 -0.30091 0.3460741 -0.0181945 0.0173377 -0.0328593 -0.1021366 1.3994924 0.1737761 -0.0480205 0.2212773 0.2908771 0.0465408 0.2588954 0.0699435 0.0237515 -0.1867468 0.0689108 -0.017994 0.1722569 -0.0657262 0.0187109 -0.0416075 0.0120963 -0.1257818 -0.0307311 0.1263068 0.0360438 0.0945493 -0.1260034 0.0129605 0.0254086 0.0157257 -0.1313219 -0.2416965 -0.0780383 0.0474434 -0.2187088 -0.0939031 -0.0138239 0.0107907 0.0022294 -0.1476587 0.1352229 -0.0399196 0.0337298 0.0459341 0.0213273 0.0144989 0.0544436 0.0042985 -0.1579346 0.4650048 0.0793484 0.1107563 0.2507302 -0.1149061 0.029461 0.1332252 0.0001389 -0.2740742 2.4850678 0.3464962 0.1624482 0.8100018 0.5670582 -0.4384155 -0.1503909 -0.3749408 1.3145016 0.5027176 0.0831595 -0.0977784 0.2258305 0.2822059 0.0620092 -0.3527629 0.0104243 0.1077515 -0.0166505 -0.0878844 -0.0336189 -0.0286273 0.0838033 -0.0022774 -0.0300027 -0.00761 0.1695758 -0.0613444 -0.0533845 -0.0320334 -0.0023635 0.084884 -0.003979 -0.0344438 -0.008714 0.1651443 0.0205308 0.0977317 -0.0229457 0.0973654 0.0172626 -0.0002244 -0.0216713 0.0040519 0.1631824 0.057795 -0.0513517 -0.0106616 -0.0637574 -0.1062962 -0.0147693 -0.0185498 -0.0145843 0.1606966 0.0794975 -0.0196624 -0.0188996 -0.0032605 -0.0138432 -0.0129093 -0.0216145 -0.0092859 0.2083476 0.2111507 -0.0565526 -0.0037069 -0.074782 0.290205 0.0869438 0.0539925 0.0864112 0.2013737 -0.1632201 0.0584954 0.0604796 0.1188768 -0.0280139 -0.0377323 0.1006191 -0.0080383 0.107304 -0.0425026 -0.0846864 -0.0060591 -0.1653766 -0.0523134 -0.0967349 -0.0245966 -0.1211993 0.0249304 0.1371403 0.0456388 -0.0874979 -0.0001042 0.1035736 0.0416134 0.009386 0.0649676 0.0098882 unknown
polarizability: 180.8311706|-1.9772952|158.0916778|8.0835218|-0.9032755|69.2601958 unknown
InChI: InChI=1S/C10H9NO2S/c1-11-10(12)13-8-3-2-4-9-7(8)5-6-14-9/h2-6,11H,1H3
charge 0 multiplicity 1
23 atoms
S  -3.270787 1.417513 -0.027723
O  1.429222 -0.602043 0.633959
O  1.856884 0.533203 -1.419323
N  3.500733 0.220328 0.239318
C  -0.86932 0.250481 0.246007
C  -2.247929 -0.080465 0.042028
C  0.053915 -0.827001 0.333089
C  -0.642111 1.679183 0.351194
C  -2.703822 -1.409431 -0.072272
C  -0.376264 -2.157025 0.22435
C  -1.752126 -2.446406 0.023247
C  -1.792237 2.42455 0.231263
C  2.246536 0.108871 -0.309718
C  4.605923 0.869641 -0.470439
H  0.343124 2.124637 0.495444
H  -3.763023 -1.635565 -0.227865
H  0.362102 -2.960595 0.300505
H  -2.075265 -3.489106 -0.060433
H  -1.90455 3.507043 0.262633
H  3.646879 -0.19487 1.159759
H  5.416654 0.152549 -0.697136
H  5.021811 1.7060 0.120627
H  4.214453 1.26771 -1.420014
