program: Gaussian 09
title: 000156249
version: EM64L-G09RevD.01
frameworkgroup: C1[X(C15H12ClN5)]
method: RPBEPBE
basis: SDD
operation: Freq
keyword: #p
keyword: freq=noraman
keyword: PBEPBE/SDD
title: #p freq=noraman PBEPBE/SDD
converged: YES YES NO NO
title: Mulliken charges:
elementType: Cl N N N N N C C C C C C C C C C C C C C C H H H H H H H H H H H H
charge: -0.050604 -0.384212 -0.024236 -0.005603 0.007302 -0.005097 -0.326654 -0.428311 0.092556 -0.044266 0.335660 -0.666397 -0.378307 -0.372289 0.089970 0.039042 -0.102458 -0.207114 -0.232926 -0.169332 -0.178244 0.243107 0.246226 0.225047 0.209882 0.343222 0.222165 0.206852 0.231910 0.296959 0.277379 0.243513 0.265258
chargesum: 0.00000
title: Mulliken charges with hydrogens summed into heavy atoms:
elementType: Cl N N N N N C C C C C C C C C C C C C C C
charge: -0.050604 -0.040990 -0.024236 -0.005603 0.007302 -0.005097 0.162680 0.006618 0.092556 -0.044266 0.335660 -0.005469 -0.081349 -0.094910 0.089970 0.039042 -0.102458 0.036399 0.032331 -0.169332 -0.178244
polarizability: 3.43829627e+02 -5.51689348e+00 2.35879957e+02 -8.91951654e+00 -1.81674371e+01 1.10221446e+02
1716.lowfreq: -4.5493 0.0008 0.0011 0.0022 2.5823 4.0671 24.1037 32.4618 36.4413
frequency: 24.0261 32.4567 36.4105 46.7163 64.4779 88.6518 105.8954 110.0854 140.9144 165.8922 172.8594 191.7376 207.0695 215.7876 244.7844 270.8647 287.1935 305.9027 349.3659 378.0586 399.5110 421.0907 434.0716 438.0024 464.9404 486.2075 534.3285 541.1768 553.5641 562.9790 582.7440 645.6354 660.3399 677.6655 698.0972 727.6512 728.9893 767.8946 790.0597 807.0460 843.7467 872.8869 896.5091 917.3722 922.0153 976.3894 983.3050 990.0496 1020.6791 1077.3136 1079.6865 1093.6712 1098.4038 1120.1527 1142.8316 1180.5563 1195.0211 1239.9062 1266.2311 1281.9904 1284.7027 1302.3264 1340.5394 1349.1727 1367.1623 1378.3234 1397.8953 1400.6357 1416.8806 1433.1426 1468.3933 1471.9131 1479.8234 1483.0272 1486.3254 1505.7793 1543.8647 1566.4975 1603.2602 2181.3958 2190.0203 2979.6022 2982.2115 2990.5635 3038.7682 3047.6516 3073.1731 3086.3387 3150.1324 3154.3081 3171.4319 3181.4875 3546.6702
redmass: 4.0432 7.7373 6.7673 4.3977 4.0039 6.4047 3.8178 6.2730 9.3659 3.4787 3.9420 4.7947 4.4770 2.0503 5.6175 4.0681 2.4642 5.9601 6.1476 6.6563 8.0924 3.0677 4.5307 4.2401 9.3342 7.2256 6.8256 1.4165 4.7287 7.5449 8.1933 7.0490 7.8100 6.6822 3.3027 6.2365 7.0111 1.2965 3.2025 2.2745 5.3034 2.4496 1.3565 1.3032 1.4041 2.6151 5.7464 1.3577 3.5089 2.2039 4.3335 2.8550 1.6892 2.1984 2.2467 1.0865 3.3916 1.1826 1.8511 1.6569 3.6497 1.9964 1.5299 1.4499 5.6113 5.2706 2.3439 1.2114 3.6681 4.9971 1.2677 1.9904 1.0966 1.0755 1.0741 3.5565 4.5411 6.6610 6.6504 12.6340 12.6403 1.0376 1.0639 1.0620 1.0970 1.1016 1.0991 1.0998 1.0878 1.0920 1.0928 1.0992 1.0774
irintensity: 0.1687 0.2943 2.8203 0.7949 0.7926 1.4884 0.7232 0.4428 0.6229 0.4305 1.3353 0.2444 1.9034 0.3018 0.3584 0.8742 0.8756 4.0227 5.5427 3.1574 4.3967 1.6013 4.2638 5.4144 0.3861 21.9665 4.1612 57.8775 29.7405 1.9459 1.5716 2.1954 1.5713 9.0466 32.1561 6.1441 36.2361 9.5354 10.5655 36.0724 9.9680 3.1484 3.4757 11.7940 2.2189 4.4724 4.8585 1.5096 12.3840 15.1019 6.9042 3.5422 11.0891 2.8753 8.6123 0.8623 1.8797 2.5037 68.0490 31.9670 2.9795 45.3180 25.8578 5.3861 27.6644 41.4209 9.0882 16.8598 86.1264 9.6821 8.6462 7.9686 23.9316 22.5468 38.4036 11.7041 428.2213 129.4520 7.5114 20.9776 7.1942 25.3615 18.4977 23.9025 13.7163 12.0919 86.4386 38.9181 6.9899 0.3091 0.3286 6.1292 72.9233
temp: 298.150 k
press: 1.00000 atm
elementType: 17 7 7 7 7 7 6 6 6 6 6 6 6 6 6 6 6 6 6 6 6 1 1 1 1 1 1 1 1 1 1 1 1
symmnumber: 1
zpe: 631707.7 jmol-1
zpe.correction: 0.240605 hartree
zpe.thermalcorrener: 0.260248 hartree
zpe.thermalcorrenthalpy: 0.261193 hartree
zpe.thermalcorrgfe: 0.190188 hartree
zpe.sumelectzpe: -1311.113427 hartree
zpe.sumelectthermal: -1311.093783 hartree
zpe.sumelectthermalent: -1311.092839 hartree
zpe.sumelectthermalfe: -1311.163843 hartree
dipole: -8.5056 2.7683 2.7996
dipole: 9.3726
quadrupole: -174.7398 -122.7745 -127.6779
quadrupole: 8.9608 1.1626 -1.4611
quadrupole: -33.0091 18.9563 14.0528 8.9608 1.1626 -1.4611
hfenergy: -1311.3540317 hartree
pointgroup: C01 [X(C15H12Cl1N5)]
dipole: -3.3319321 1.4532046 0.6196468 debye
polarizability: 343.1522793|-10.0180795|223.7172308|5.5505249|-42.8816332|123.0615204 unknown
InChI: InChI=1S/C15H12ClN5/c1-2-6-19-15-14(10-4-3-5-11(16)7-10)20-12(8-17)13(9-18)21-15/h3-5,7,19H,2,6H2,1H3
charge 0 multiplicity 1
33 atoms
Cl -4.99758 -0.160744 -1.275151
N  -0.497187 1.970792 0.18075
N  1.710812 1.29526 -0.158971
N  1.029578 -1.364395 0.5385
N  5.141022 0.991068 -0.677355
N  4.205643 -2.806276 0.806819
C  -0.138165 3.390441 -0.025044
C  -1.392189 4.284276 0.034174
C  0.411772 0.951388 0.119569
C  0.053251 -0.444976 0.366056
C  -1.350479 -0.926008 0.464038
C  -2.422126 4.002665 -1.083822
C  -2.385132 -0.372912 -0.342791
C  -1.659505 -1.997829 1.345356
C  2.664732 0.327175 -0.060234
C  2.343317 -0.998695 0.369949
C  -3.69041 -0.882124 -0.22741
C  -2.97776 -2.486368 1.439902
C  -4.016384 -1.927384 0.65693
C  4.017447 0.693642 -0.401271
C  3.356585 -1.988491 0.606485
H  0.369575 3.488824 -1.002663
H  0.598878 3.69638 0.742766
H  -1.050884 5.3336 -0.03996
H  -1.873212 4.18616 1.028778
H  -1.454229 1.751326 0.461774
H  -1.954746 4.091205 -2.081694
H  -2.862971 2.990257 -1.009659
H  -3.257568 4.723168 -1.035538
H  -2.169704 0.391759 -1.095642
H  -0.851708 -2.43864 1.936278
H  -3.207529 -3.308411 2.125315
H  -5.042343 -2.299134 0.728166
