program: Gaussian 09
title: 000156248
version: EM64L-G09RevD.01
frameworkgroup: C1[X(C19H17ClF3NO7)]
method: RPBEPBE
basis: SDD
operation: Freq
keyword: #p
keyword: freq=noraman
keyword: PBEPBE/SDD
title: #p freq=noraman PBEPBE/SDD
converged: YES YES NO NO
title: Mulliken charges:
elementType: Cl F F F O O O O O O O N C C C C C C C C C C C C C C C C C C C H H H H H H H H H H H H H H H H H
charge: -0.000647 -0.168441 -0.162997 -0.165025 -0.266814 -0.265555 -0.264639 -0.240434 -0.300405 -0.202439 -0.201661 0.018713 -0.091939 0.259999 0.231335 0.375376 -0.456424 -0.697018 0.255641 -0.322481 -0.384502 0.469308 0.303028 -0.322565 -0.304209 -0.301210 -0.340042 -0.343235 -0.221458 0.258147 -0.499693 0.263786 0.345843 0.264226 0.226156 0.238385 0.285944 0.274929 0.307944 0.258354 0.228241 0.288844 0.284314 0.212971 0.201499 0.239459 0.214136 0.217254
chargesum: 0.00000
title: Mulliken charges with hydrogens summed into heavy atoms:
elementType: Cl F F F O O O O O O O N C C C C C C C C C C C C C C C C C C C
charge: -0.000647 -0.168441 -0.162997 -0.165025 -0.266814 -0.265555 -0.264639 -0.240434 -0.300405 -0.202439 -0.201661 0.018713 0.171847 0.259999 0.231335 0.375376 -0.110581 0.031749 0.255641 -0.036536 -0.109573 0.469308 0.303028 -0.322565 0.003735 0.185386 -0.051198 -0.058921 0.193012 0.258147 0.171156
polarizability: 3.57188439e+02 -2.76652084e+00 2.78306758e+02 1.24349151e+01 -1.61911483e+01 1.70089705e+02
1716.lowfreq: -3.0970 -0.0009 -0.0006 -0.0005 2.0885 5.1314 13.8979 20.0932 21.0980
frequency: 13.8257 20.0278 20.8871 24.5429 35.0767 35.8208 46.8435 61.5596 63.4697 74.6677 86.8256 94.9890 99.3033 106.4312 135.1046 135.7934 144.7965 162.9621 166.4977 195.3628 211.4786 220.1048 224.9488 235.7002 243.8207 253.8232 261.9533 276.9931 302.7257 309.7518 331.2009 335.9612 352.0115 359.9310 386.7731 390.3057 418.4654 430.7449 445.9972 461.1098 472.4309 479.6920 505.4119 529.5645 553.7200 556.9143 598.8471 607.3075 623.4555 640.3547 652.5231 658.3251 666.9505 688.0173 695.6038 723.0713 739.1880 752.0013 771.0411 775.3202 813.8105 816.9898 838.6011 848.8463 856.0616 887.4769 893.0694 920.6044 964.5277 972.9734 983.0529 986.2295 993.4583 1005.4950 1020.9851 1023.5093 1025.7321 1040.7729 1062.3853 1064.1225 1069.0236 1102.0087 1107.5905 1121.3095 1132.2722 1136.3128 1149.1967 1160.1920 1163.2249 1206.3401 1214.7357 1217.4421 1242.3177 1247.7532 1266.0132 1266.3107 1287.9200 1290.2514 1305.3378 1352.3524 1355.6573 1372.3257 1380.3642 1384.5567 1388.4515 1400.5065 1414.8303 1437.2228 1448.7724 1460.3883 1461.0150 1461.6184 1463.0107 1474.8319 1477.9802 1480.7339 1571.2187 1581.7801 1594.7400 1614.6037 1650.4495 2931.7302 2942.6876 2989.8079 3006.1380 3022.0449 3033.5620 3047.5740 3107.0079 3109.5996 3112.0334 3120.3504 3169.9350 3172.3946 3175.1549 3177.8015 3184.4265 3190.2008
redmass: 6.4022 10.1934 8.8462 8.7844 4.1894 9.2412 7.1268 6.1842 6.1005 8.3429 5.9379 3.6053 7.1047 4.4150 3.2670 8.2520 6.7804 6.6749 5.8778 7.2474 2.8372 1.8803 1.1597 7.2304 3.9006 3.4591 6.7229 9.2061 4.4710 4.4009 4.8237 4.0921 6.4330 8.9091 7.6339 9.1484 5.8112 7.4180 3.5943 4.0629 8.4193 8.2405 2.6784 8.3073 5.6113 6.1436 10.0296 6.6131 5.3935 5.4953 6.7901 7.7352 6.9380 5.3297 4.9174 4.9148 6.1890 5.5010 9.1156 3.2230 3.5026 4.0191 1.6002 5.3810 1.3648 3.2083 1.4298 1.4009 1.9749 1.8994 6.1175 2.8740 1.4604 2.4600 8.5041 2.4700 6.3634 3.0457 3.7658 2.9288 2.4484 2.3263 2.2047 1.6758 2.0257 1.8501 1.7211 1.3454 1.4284 3.5167 1.1209 8.2045 2.1315 1.5997 2.1322 1.1467 2.8911 1.5391 1.3012 4.1331 1.4554 5.4817 1.4123 1.2295 7.9458 5.5127 4.9908 1.1458 1.0913 1.0776 1.0842 1.0817 2.4137 1.0501 1.4144 1.8140 8.1508 8.1471 6.9331 7.0642 9.8362 1.0547 1.0358 1.1023 1.0345 1.1036 1.0588 1.0847 1.1077 1.0988 1.1006 1.1014 1.0892 1.0888 1.0929 1.0929 1.0972 1.0977
irintensity: 0.4008 0.5407 0.3487 0.0171 0.0310 0.5604 0.7212 0.9790 0.4781 4.2186 2.5963 3.6310 2.5202 5.1487 0.3603 1.4378 2.1362 0.9975 0.4643 2.9447 2.7440 0.7987 1.7576 2.9854 1.2465 6.4415 0.9282 1.5604 11.4002 2.7171 10.9970 10.2302 7.7206 1.2980 3.1579 1.6978 3.7701 2.0683 10.0287 9.9711 1.2405 0.7648 6.8388 0.3300 2.2569 10.6656 21.7460 15.1264 11.4516 9.1379 18.0418 3.0403 25.7438 0.8846 1.1152 8.1671 15.6809 23.3427 11.0569 2.4708 19.9563 27.4423 38.3382 10.3771 35.2854 25.0158 40.7284 34.7202 44.5289 22.4997 174.0863 60.5545 12.3370 24.1264 385.8957 4.3676 48.7319 51.2188 153.9906 142.9123 136.1097 47.9176 76.0888 12.9081 64.5430 26.5359 28.0863 5.6464 9.9645 26.8419 2.3412 791.8554 28.7538 162.6480 163.3820 16.1526 413.2108 34.4209 11.6959 74.7256 3.6657 12.8521 2.4693 26.3530 17.0495 21.2035 101.4413 0.4415 16.8931 2.8717 33.9749 14.9865 130.3692 15.0301 27.1486 52.0475 46.3143 105.7250 301.3191 12.7905 165.2146 50.2133 88.5756 34.4982 11.5251 44.4602 38.5300 5.6706 10.8658 22.3182 16.2043 7.7025 1.3451 0.9245 8.0454 1.7552 4.3475 1.6678
temp: 298.150 k
press: 1.00000 atm
elementType: 17 9 9 9 8 8 8 8 8 8 8 7 6 6 6 6 6 6 6 6 6 6 6 6 6 6 6 6 6 6 6 1 1 1 1 1 1 1 1 1 1 1 1 1 1 1 1 1
symmnumber: 1
zpe: 881004.5 jmol-1
zpe.correction: 0.335557 hartree
zpe.thermalcorrener: 0.366127 hartree
zpe.thermalcorrenthalpy: 0.367071 hartree
zpe.thermalcorrgfe: 0.269286 hartree
zpe.sumelectzpe: -2072.719546 hartree
zpe.sumelectthermal: -2072.688975 hartree
zpe.sumelectthermalent: -2072.688031 hartree
zpe.sumelectthermalfe: -2072.785817 hartree
dipole: -0.5070 4.1145 4.0212
dipole: 5.7754
quadrupole: -235.4875 -165.5426 -177.2306
quadrupole: 12.5367 -3.4359 2.9332
quadrupole: -42.7340 27.2110 15.5230 12.5367 -3.4359 2.9332
hfenergy: -2073.0551025 hartree
pointgroup: C01 [X(C19H17Cl1F3N1O7)]
dipole: -1.1032438 1.3307955 1.474744 debye
polarizability: 331.9078878|21.4286012|286.5378241|57.4202041|2.9352662|187.1391894 unknown
InChI: InChI=1S/C19H17ClF3NO7/c1-11(18(25)29-8-7-28-2)30-17-10-13(4-5-15(17)24(26)27)31-16-6-3-12(9-14(16)20)19(21,22)23/h3-6,9-11H,7-8H2,1-2H3
charge 0 multiplicity 1
48 atoms
Cl -1.34324 -4.724521 -1.274955
F  -5.694705 -0.043005 -0.811541
F  -4.947854 -0.270098 -2.934619
F  -5.911136 -2.033406 -1.890106
O  2.924395 1.196698 -0.822037
O  0.079403 -2.628468 0.266978
O  0.353283 3.652007 0.040091
O  0.224784 1.889643 -1.492211
O  -1.888037 2.163936 1.439925
O  5.640276 -0.162289 2.046052
O  4.69653 1.755041 1.251811
N  4.673353 0.481131 1.477295
C  2.40637 2.53899 -0.462602
C  2.611434 0.131042 0.036298
C  3.473592 -0.281505 1.097155
C  1.186157 -1.79223 0.512746
C  1.475558 -0.651082 -0.263828
C  3.173479 3.535256 -1.340552
C  0.890249 2.610302 -0.720105
C  3.20593 -1.471121 1.817715
C  2.055629 -2.223674 1.542565
C  -1.136458 -2.134559 -0.2395
C  -3.692706 -1.370628 -1.155456
C  -1.948215 -3.051747 -0.952737
C  -1.622022 -0.831635 0.021152
C  -1.113014 3.90187 -0.06829
C  -3.220753 -2.678495 -1.413276
C  -2.892671 -0.448134 -0.442898
C  -1.778834 3.616078 1.270302
C  -5.030906 -0.94524 -1.681557
C  -2.415583 1.805114 2.761531
H  2.603287 2.738444 0.605292
H  0.853719 -0.338524 -1.106822
H  4.246492 3.462515 -1.101525
H  2.828225 4.564149 -1.142184
H  3.024714 3.300286 -2.408033
H  3.909436 -1.776414 2.596786
H  1.81662 -3.131641 2.101494
H  -1.026021 -0.102005 0.574828
H  -1.53181 3.26522 -0.866817
H  -1.214024 4.968336 -0.330352
H  -3.836811 -3.399268 -1.957437
H  -3.243744 0.564464 -0.226188
H  -1.182494 4.06089 2.095668
H  -2.790465 4.081031 1.277631
H  -2.476913 0.705998 2.781863
H  -3.427494 2.231378 2.922338
H  -1.740904 2.154269 3.570112
