program: Gaussian 09
title: 000156240
version: EM64L-G09RevD.01
frameworkgroup: C1[X(C22H18O3)]
method: RPBEPBE
basis: SDD
operation: Freq
keyword: #pfreq=noraman
keyword: PBEPBE/SDD
title: #p freq=noraman PBEPBE/SDD
converged: YES YES NO NO
title: Mulliken charges:
elementType: O O O C C C C C C C C C C C C C C C C C C C C C C H H H H H H H H H H H H H H H H H H
charge: -0.324707 -0.261798 -0.185228 0.135088 0.380586 -0.070029 0.151086 0.360970 -0.072815 0.287592 0.469316 -0.460717 -0.513887 -0.837504 -0.357995 -0.443434 -0.384622 -0.606142 0.317352 -0.395137 -0.263422 -0.259848 0.255288 -0.758541 -0.535661 0.252663 0.237606 0.241395 0.238147 0.237891 0.280397 0.230029 0.253489 0.263749 0.239717 0.227360 0.229910 0.250413 0.252302 0.250288 0.221565 0.220851 0.246439
chargesum: 0.00000
title: Mulliken charges with hydrogens summed into heavy atoms:
elementType: O O O C C C C C C C C C C C C C C C C C C C C C C
charge: -0.324707 -0.261798 -0.185228 0.135088 0.380586 -0.070029 0.151086 0.360970 -0.072815 0.287592 0.469316 -0.208054 -0.276282 -0.120071 -0.077597 -0.213405 -0.131133 -0.342393 0.317352 -0.155420 -0.036062 -0.029938 0.255288 -0.005539 0.153193
polarizability: 4.67423140e+02 -3.70796255e+00 2.75307867e+02 7.52802710e+00 -2.17202135e+01 1.26070393e+02
1716.lowfreq: -4.1012 -0.0005 -0.0003 0.0005 2.1938 6.2288 29.6219 34.8958 53.5076
frequency: 29.5908 34.8901 53.4937 54.5713 69.4667 81.4246 88.4673 100.1096 121.3294 137.8249 150.9924 182.2781 207.7677 217.8481 222.8278 259.6924 269.0224 298.2298 322.6309 334.1564 351.2473 370.0971 405.6183 415.6731 419.8778 442.1850 463.8325 487.2282 521.7770 527.6025 548.3878 549.6768 550.4184 569.4087 599.6914 618.1066 619.9534 633.9511 680.9135 704.1184 715.2228 739.7627 770.1660 781.8031 785.1913 804.7691 813.4569 822.9899 846.2279 857.1622 899.0690 901.7175 914.1103 944.9214 961.7956 968.4485 983.3435 984.1328 989.5393 1003.7701 1015.6686 1026.1987 1037.6107 1042.6536 1061.5402 1075.7111 1110.8870 1114.9671 1143.8689 1152.4623 1166.4875 1176.7477 1185.2961 1188.3774 1239.7297 1257.4360 1268.6049 1287.4788 1315.4756 1344.4109 1354.2583 1380.1149 1381.2019 1397.1257 1401.4295 1403.1870 1428.1882 1434.1571 1437.8879 1451.9101 1454.7764 1461.9370 1466.1917 1470.5924 1473.7023 1482.6554 1498.5953 1506.4924 1548.2714 1562.2802 1576.2157 1619.8638 1623.9477 1634.5282 1685.3974 2960.1519 2984.3599 3002.7156 3048.7215 3053.5490 3094.0752 3121.0195 3125.1365 3129.7450 3130.8854 3141.7254 3147.2768 3152.0653 3153.4009 3164.8485 3172.8069 3173.6133 3199.4662
redmass: 4.7727 7.0901 3.0615 2.0476 3.2649 2.3019 2.0921 2.6491 3.9170 4.0404 1.4555 3.6851 3.5826 3.2397 1.4310 6.2565 3.3535 3.6097 5.3816 4.9980 4.8300 3.5718 4.5335 5.3028 3.8077 3.0848 5.8737 4.6480 3.7313 4.4774 5.0183 3.7117 3.4788 5.1173 4.3606 4.8118 3.6851 6.0169 4.8697 3.2016 5.3200 4.1919 1.6474 2.6681 4.7761 1.5383 4.5469 1.7082 1.9923 4.7925 2.1389 2.1371 5.5511 3.9977 1.3689 1.3479 2.0542 1.3728 1.3531 5.1162 6.0852 2.2372 1.6577 1.6470 2.1792 3.0327 1.2582 2.5745 1.5147 2.1338 1.8118 1.2252 1.3149 1.5283 1.5279 2.3003 1.9880 2.0042 2.9556 4.0028 3.0705 2.6166 1.4750 5.4471 2.2075 1.4024 3.4916 1.2512 4.9108 1.0572 1.0538 2.3691 1.0518 1.6330 1.1288 1.0509 2.2905 2.1630 6.0988 7.7418 7.2654 6.3538 6.6745 6.6413 10.5393 1.0329 1.0420 1.0385 1.1040 1.0973 1.0947 1.0929 1.0994 1.0888 1.0857 1.1017 1.0893 1.0918 1.0896 1.0933 1.0947 1.0981 1.0928
irintensity: 0.3656 0.0779 1.5185 2.6289 0.9442 0.2278 3.4479 3.8229 2.7611 2.8822 0.1614 1.0941 1.0303 1.3982 0.3956 1.3804 1.9056 2.0647 1.4727 0.1877 2.9208 0.3500 1.4587 0.8824 3.7714 0.1540 0.2833 3.9891 10.1164 13.0054 18.5958 1.3063 0.1660 8.8836 1.5834 12.5603 1.7451 1.4152 7.6739 12.1326 8.6770 37.2598 68.8389 2.1309 1.7730 46.1159 18.9346 5.6902 20.2752 5.3283 13.3304 42.1272 2.5341 9.8847 0.2727 2.7295 39.7626 2.2805 1.3467 40.0116 172.2464 19.2282 5.7401 0.7804 6.4235 14.4900 0.1213 34.8843 22.2852 181.8646 191.1138 26.6571 4.9106 53.5823 4.3946 138.4684 93.1687 10.6475 23.4092 13.1317 14.7790 60.4380 20.0625 1.7953 5.0686 10.4916 2.2384 16.5617 1.5652 18.8781 17.0826 43.9083 13.3833 3.5306 43.8937 12.6562 4.8538 114.9199 27.3223 3.5344 14.9022 18.4734 96.1485 68.3133 152.0674 85.5512 32.5640 2.3058 47.7700 16.2548 6.9286 17.8420 30.9765 7.5956 0.6209 8.4835 9.6530 6.4191 12.1478 32.4113 33.9975 28.8195 6.5036
temp: 298.150 k
press: 1.00000 atm
elementType: 8 8 8 6 6 6 6 6 6 6 6 6 6 6 6 6 6 6 6 6 6 6 6 6 6 1 1 1 1 1 1 1 1 1 1 1 1 1 1 1 1 1 1
symmnumber: 1
zpe: 882282.2 jmol-1
zpe.correction: 0.336044 hartree
zpe.thermalcorrener: 0.357808 hartree
zpe.thermalcorrenthalpy: 0.358752 hartree
zpe.thermalcorrgfe: 0.284645 hartree
zpe.sumelectzpe: -1073.099302 hartree
zpe.sumelectthermal: -1073.077537 hartree
zpe.sumelectthermalent: -1073.076593 hartree
zpe.sumelectthermalfe: -1073.150701 hartree
dipole: 1.1642 1.4071 -1.8570
dipole: 2.6045
quadrupole: -120.0227 -119.8109 -157.1034
quadrupole: 14.0131 -0.3170 -7.6609
quadrupole: 12.2896 12.5014 -24.7910 14.0131 -0.3170 -7.6609
hfenergy: -1073.4353455 hartree
pointgroup: C01 [X(C22H18O3)]
dipole: 0.4377866 0.5694584 -0.7307912 debye
polarizability: 467.6245115|0.3163377|275.5696819|4.3876567|-20.3681921|125.6072068 unknown
InChI: InChI=1S/C22H18O3/c1-13-17-6-4-5-7-20(17)22(25-14(2)23)21-18(13)10-8-15-12-16(24-3)9-11-19(15)21/h4-12H,1-3H3
charge 0 multiplicity 1
43 atoms
O  -0.512516 2.011317 -0.313323
O  5.655496 -0.202094 -0.157936
O  -0.822419 2.377232 1.989792
C  -0.095338 -0.418723 -0.082297
C  -0.696535 -1.737299 0.126379
C  -2.107357 -1.941522 0.097047
C  1.37573 -0.2990 -0.132697
C  -2.982365 -0.828387 -0.133214
C  -0.998122 0.6601 -0.21094
C  -2.411271 0.501905 -0.271441
C  2.188736 -1.451122 0.183231
C  0.1853 -2.856818 0.410482
C  1.551761 -2.718503 0.472387
C  -2.657684 -3.342571 0.325217
C  2.072229 0.883275 -0.527516
C  -4.416906 -0.946882 -0.21092
C  -3.279237 1.629034 -0.477663
C  3.605256 -1.367819 0.169287
C  4.253433 -0.172464 -0.183745
C  3.474864 0.957789 -0.557446
C  -5.234123 0.163677 -0.410178
C  -4.659678 1.468105 -0.547088
C  -0.462587 2.796487 0.878257
C  0.104698 4.159533 0.551825
C  6.367749 1.022595 -0.531106
H  -0.257161 -3.83786 0.599314
H  2.188001 -3.578128 0.712846
H  -2.406834 -3.711194 1.33784
H  -3.750796 -3.387824 0.229963
H  -2.239161 -4.064611 -0.400052
H  1.50067 1.751976 -0.853757
H  -4.886666 -1.928855 -0.113677
H  -2.834773 2.620133 -0.602121
H  4.211207 -2.244811 0.418944
H  3.952066 1.887976 -0.880311
H  -6.32118 0.040214 -0.465888
H  -5.308859 2.334856 -0.711267
H  1.195935 4.073317 0.395091
H  -0.079441 4.84804 1.389234
H  -0.335149 4.55619 -0.377696
H  6.110135 1.860631 0.145367
H  6.153888 1.310852 -1.578739
H  7.434501 0.776552 -0.425884
