program: Gaussian 09
title: 000156236
version: EM64L-G09RevD.01
frameworkgroup: C1[X(C17H19NO)]
method: RPBEPBE
basis: SDD
operation: Freq
keyword: #p
keyword: freq=noraman
keyword: PBEPBE/SDD
title: #p freq=noraman PBEPBE/SDD
converged: NO YES NO NO
title: Mulliken charges:
elementType: O N C C C C C C C C C C C C C C C C C H H H H H H H H H H H H H H H H H H H
charge: -0.222104 -0.696887 0.116230 0.527881 -0.698591 -0.698580 -0.746642 -0.561633 0.196416 -0.409153 0.211403 -0.406582 0.216917 -0.358836 -0.358859 -0.242954 -0.405591 -0.405537 0.480496 0.210746 0.217785 0.223951 0.217787 0.210742 0.223961 0.220358 0.219181 0.219193 0.270301 0.234511 0.270709 0.239326 0.239369 0.198405 0.217420 0.217447 0.305710 0.305706
chargesum: 0.00000
title: Mulliken charges with hydrogens summed into heavy atoms:
elementType: O N C C C C C C C C C C C C C C C C C
charge: -0.222104 -0.085471 0.116230 0.527881 -0.046109 -0.046090 -0.087909 -0.291332 0.196416 -0.174642 0.211403 -0.135874 0.216917 -0.119511 -0.119491 -0.044549 -0.188172 -0.188090 0.480496
polarizability: 2.73446069e+02 -7.83756499e+00 1.90492520e+02 3.52188144e-02 1.00147753e-01 1.41916221e+02
1716.lowfreq: -50.7586 -6.8901 -4.8891 -0.0006 -0.0005 -0.0004 1.6634 26.6575 43.6597
frequency: -50.7346 26.3389 43.6580 64.6554 81.7830 139.5350 149.8909 156.3485 200.6927 221.4701 227.0437 248.8205 266.2028 282.6219 305.6490 307.1902 328.4017 340.1283 350.6053 367.8430 377.9208 378.4009 394.2454 404.1849 443.9760 483.2562 490.1588 532.7318 565.6940 606.9441 622.6990 663.4892 667.8801 731.6761 746.6615 758.1405 812.2828 817.1984 818.3618 826.5869 855.6829 865.6131 916.0350 925.7811 931.4041 939.7113 942.8057 954.1634 980.5524 995.3815 1005.0260 1016.4729 1016.9993 1021.6211 1032.6968 1100.4676 1126.3344 1126.9638 1189.0227 1201.7292 1214.2099 1219.3828 1249.9719 1270.1244 1299.3805 1302.3929 1316.6685 1354.7139 1365.7848 1373.7020 1374.6021 1388.4024 1398.6987 1403.1633 1428.8899 1459.6414 1464.9242 1464.9962 1476.3470 1483.5706 1485.5643 1496.3825 1520.1648 1554.4893 1569.5502 1589.9994 1618.4837 1632.6856 1645.0019 2929.4977 2974.3285 2974.7616 2980.0404 3069.1551 3070.1370 3073.8957 3078.3847 3081.1028 3083.8120 3116.1688 3117.9452 3125.9323 3140.0912 3146.0590 3149.1756 3158.8645 3567.5384 3707.0779
redmass: 3.6664 2.8965 5.0661 5.3258 4.0380 5.1989 3.5218 5.3228 1.4462 1.5579 2.7725 1.4405 2.4687 3.2066 1.0866 4.1567 2.8097 2.6163 1.2557 1.0643 2.6847 4.8037 2.6864 2.7784 3.1508 3.0910 3.0202 2.6086 6.4867 3.7227 6.0596 4.8980 6.2883 3.8273 4.8359 3.2287 3.2270 1.2578 4.9496 1.8969 1.4120 3.7518 1.7121 1.4538 1.6457 1.3588 1.2049 1.3500 1.5559 3.4612 1.5422 1.4425 1.4871 1.3925 2.5614 2.4612 1.6960 1.2348 1.0982 2.9842 2.6567 1.8442 2.2979 1.8680 2.2137 1.3662 3.2533 2.3860 4.2160 1.1814 1.2652 2.1626 2.3550 1.4478 3.6921 1.0504 1.1711 1.0500 1.2991 1.4913 1.0495 1.1065 3.3678 7.8890 6.7651 5.9903 6.6716 2.3131 1.7209 1.0860 1.0346 1.0348 1.0358 1.1003 1.1000 1.1006 1.0987 1.0995 1.0991 1.0874 1.0872 1.0868 1.0960 1.0972 1.0956 1.0905 1.0449 1.1040
irintensity: 0.1541 0.2890 1.8209 0.5272 0.2933 1.1361 6.5885 4.3331 2.5574 2.9481 0.0659 0.2838 1.1400 0.0019 0.0179 1.5217 5.8760 0.0820 302.7059 0.0096 1.5603 6.1336 0.8019 0.4001 0.0514 4.5226 10.4424 4.5800 4.7800 15.0856 1.5972 1.2138 6.8732 2.8185 11.0748 3.0169 0.4774 0.0046 1.8383 81.0493 26.5053 20.1076 0.0043 8.5080 2.2747 0.1677 0.1973 0.0171 1.3613 1.8476 3.1839 0.1617 1.0873 0.5518 4.3049 35.2916 10.4961 16.5401 30.3911 5.5382 3.8700 14.0167 97.5996 14.1704 3.5367 3.0681 66.6561 16.0501 8.1422 18.7630 13.0004 14.9126 57.3301 8.8881 0.4352 0.1568 2.9583 1.1040 37.5919 2.8217 12.8930 29.9900 115.5605 37.5372 2.8963 301.6001 46.9644 6.3479 311.8041 92.7426 31.9133 32.6794 30.3405 5.6767 5.5730 13.4660 119.1045 30.6975 47.4421 3.7283 35.6191 10.9754 32.5645 1.6728 18.8811 5.2440 82.0795 20.8255
temp: 298.150 k
press: 1.00000 atm
elementType: 8 7 6 6 6 6 6 6 6 6 6 6 6 6 6 6 6 6 6 1 1 1 1 1 1 1 1 1 1 1 1 1 1 1 1 1 1 1
symmnumber: 1
zpe: 821605.4 jmol-1
zpe.correction: 0.312933 hartree
zpe.thermalcorrener: 0.330815 hartree
zpe.thermalcorrenthalpy: 0.331760 hartree
zpe.thermalcorrgfe: 0.267535 hartree
zpe.sumelectzpe: -787.818030 hartree
zpe.sumelectthermal: -787.800148 hartree
zpe.sumelectthermalent: -787.799204 hartree
zpe.sumelectthermalfe: -787.863428 hartree
dipole: 1.2558 -5.4042 0.0018
dipole: 5.5482
quadrupole: -78.1980 -132.7282 -108.1188
quadrupole: -10.9486 0.0173 0.0434
quadrupole: 28.1503 -26.3799 -1.7704 -10.9486 0.0173 0.0434
hfenergy: -788.1309632 hartree
pointgroup: C01 [X(C17H19N1O1)]
dipole: -0.522019 -2.119497 0.0005732 debye
polarizability: 273.6380479|6.7427649|190.3003826|0.0474699|-0.1304992|141.916379 unknown
InChI: InChI=1S/C17H19NO/c1-17(2,3)14-7-4-13(11-19)16(10-14)12-5-8-15(18)9-6-12/h4-11H,18H2,1-3H3
charge 0 multiplicity 1
38 atoms
O  -0.475471 4.058666 -0.001359
N  -5.46487 -1.563293 -0.000955
C  3.520175 -1.271721 -0.000021
C  2.383642 -0.224408 -0.000144
C  4.400354 -1.072267 1.271995
C  4.400202 -1.072854 -1.27223
C  2.98715 -2.72689 0.00034
C  1.01302 -0.584967 -0.000133
C  -0.028703 0.377238 -0.000201
C  2.701118 1.166918 -0.000275
C  0.31797 1.762376 -0.000208
C  1.690755 2.137431 -0.000325
C  -1.455964 -0.095585 -0.000316
C  -2.143271 -0.352955 1.214814
C  -2.145712 -0.345259 -1.215679
C  -0.725079 2.818984 0.00017
C  -3.465801 -0.836473 1.222892
C  -3.468219 -0.828824 -1.224181
C  -4.154228 -1.083672 -0.000753
H  5.227092 -1.807057 1.28044
H  4.844385 -0.061851 1.309153
H  3.80208 -1.213559 2.190568
H  4.844302 -0.062488 -1.309887
H  5.226897 -1.807697 -1.280472
H  3.801806 -1.214506 -2.190668
H  3.838345 -3.431747 0.00034
H  2.37642 -2.939136 0.896975
H  2.376126 -2.939469 -0.896016
H  0.725249 -1.640216 -0.000174
H  3.749513 1.487128 -0.000312
H  1.925166 3.208012 -0.000335
H  -1.633737 -0.168928 2.167973
H  -1.63804 -0.155266 -2.168661
H  -1.777809 2.452631 -0.000416
H  -3.972391 -1.023008 2.177942
H  -3.976666 -1.009451 -2.179378
H  -5.95873 -1.731208 -0.872251
H  -5.956973 -1.736732 0.870253
