program: Gaussian 09
title: 000156234
version: EM64L-G09RevD.01
frameworkgroup: C1[X(C20H16O3)]
method: RPBEPBE
basis: SDD
operation: Freq
keyword: #pfreq=noraman
keyword: PBEPBE/SDD
title: #p freq=noraman PBEPBE/SDD
converged: YES YES NO NO
title: Mulliken charges:
elementType: O O O C C C C C C C C C C C C C C C C C C C C H H H H H H H H H H H H H H H H
charge: -0.237914 -0.210292 -0.264993 -0.039271 0.350582 0.572083 -0.745364 0.061463 -0.655903 0.099807 -0.390803 -0.409873 0.394213 0.412515 -0.367957 -0.441684 -0.210723 -0.222208 -0.442367 -0.557442 0.329556 -0.367530 -0.536976 0.212937 0.250591 0.252488 0.254378 0.242188 0.251706 0.269920 0.240314 0.233188 0.236433 0.238051 0.265121 0.243372 0.220520 0.222032 0.247844
chargesum: 0.00000
title: Mulliken charges with hydrogens summed into heavy atoms:
elementType: O O O C C C C C C C C C C C C C C C C C C C C
charge: -0.237914 -0.210292 -0.264993 -0.039271 0.350582 0.572083 -0.029349 0.061463 -0.401526 0.099807 -0.148615 -0.158167 0.394213 0.412515 -0.098037 -0.201371 0.022465 0.014225 -0.204316 -0.292322 0.329556 -0.124158 0.153420
polarizability: 3.65411435e+02 2.18984133e+00 1.67956385e+02 -2.93959133e+01 -2.69747772e+00 1.85620649e+02
1716.lowfreq: -6.4459 -3.1902 -0.0008 -0.0006 -0.0004 2.7038 15.4102 38.1589 46.9618
frequency: 15.3603 38.1356 46.9552 67.8491 104.0483 127.0768 140.9418 169.0594 181.6009 201.3783 221.6311 229.7043 246.6329 271.3833 275.5479 302.3164 306.9308 363.5552 378.3570 403.8405 416.5808 433.4513 471.9613 476.8655 508.7787 518.1164 544.9616 546.4478 559.4716 578.1268 618.3017 633.4105 664.4954 681.1388 689.3830 709.8745 744.1435 770.7209 781.2517 784.6952 786.6741 809.1570 817.9776 831.3120 842.4425 890.9885 896.1401 905.0847 911.5104 949.3957 956.4645 965.2090 967.1961 975.6689 1001.7786 1002.2629 1014.9460 1047.3127 1076.0330 1092.4046 1110.5521 1114.4442 1141.5890 1142.3692 1171.7357 1174.0898 1178.5893 1193.1765 1208.5865 1248.1000 1262.3708 1270.6404 1276.9520 1279.2404 1343.7233 1389.2463 1401.3602 1404.0778 1413.5531 1436.2828 1439.3785 1449.2250 1457.0176 1468.6215 1469.2781 1471.2719 1477.0305 1484.7408 1509.5507 1577.3219 1604.3084 1613.8522 1617.7571 1645.8115 1692.5376 2960.5652 2999.2194 3049.1182 3097.8481 3110.5404 3124.6434 3126.1724 3128.3449 3132.1266 3138.7704 3144.3455 3152.8129 3154.2139 3155.3958 3164.4773 3170.0895
redmass: 4.5476 5.1614 5.9832 3.8825 4.5441 4.6551 5.2653 3.5881 3.1907 4.6196 2.7219 2.4866 2.2552 3.8146 1.2222 3.0524 3.7888 4.4123 4.7947 3.2419 3.3415 5.3759 4.2680 2.5586 6.7123 6.4577 4.6153 5.1925 5.0996 4.3228 3.6837 6.4468 4.9139 5.2640 3.7174 6.3618 4.9358 2.6777 2.3392 1.7980 4.1723 1.7161 1.9063 3.1652 3.0262 1.3934 1.6874 3.5436 1.6046 3.8258 1.4435 3.3464 1.5081 1.4098 1.3402 4.1419 2.2132 4.0215 2.0649 2.0867 1.2571 1.8292 1.4811 1.7132 1.1160 1.2044 1.5942 2.4947 1.9555 3.4305 2.2181 3.3263 1.5204 1.7109 1.8672 1.2627 7.5632 2.7333 4.2257 3.2755 1.6582 2.4332 2.1816 1.0504 1.1495 1.1210 1.0617 2.2792 3.8280 7.3772 7.5782 6.1206 7.1145 6.9247 12.9406 1.0330 1.0357 1.1041 1.0993 1.1011 1.0928 1.0954 1.0871 1.0863 1.0902 1.0901 1.0950 1.0940 1.0953 1.0944 1.1004
irintensity: 0.3664 1.4783 0.1770 3.9259 3.4363 0.2802 1.4269 2.6233 0.3261 1.1405 5.7110 1.2346 0.1347 4.4900 0.1430 0.2098 2.1561 0.7885 2.4655 0.0946 0.6664 0.7575 3.0535 17.9907 1.0977 2.6028 29.7064 8.7853 5.7680 10.0185 2.3165 0.4010 26.9361 2.8527 5.0304 2.8998 13.9453 19.5333 5.7154 36.0879 2.0751 20.0358 57.9098 81.9339 4.2618 2.6717 45.7212 2.1147 19.2749 18.7789 6.8321 158.9968 22.4767 9.4441 0.2459 66.7838 4.5897 15.3786 41.8377 19.5030 0.1837 5.3384 6.7535 47.2599 21.0661 46.3449 79.8747 44.7435 66.0020 91.7950 179.3761 4.7982 4.5513 7.6128 6.0119 18.8249 5.7102 1.8174 3.1295 2.8026 4.5213 19.4197 3.4319 13.5899 21.3651 72.5069 12.2574 16.7342 66.6894 7.0293 5.5130 88.9795 9.8386 86.2978 431.8498 90.6584 11.0869 48.2199 18.1922 24.4503 25.7162 7.8635 6.3726 1.1820 10.9357 7.0194 8.4503 10.4533 12.1454 16.9611 23.3792
temp: 298.150 k
press: 1.00000 atm
elementType: 8 8 8 6 6 6 6 6 6 6 6 6 6 6 6 6 6 6 6 6 6 6 6 1 1 1 1 1 1 1 1 1 1 1 1 1 1 1 1
symmnumber: 1
zpe: 794987.4 jmol-1
zpe.correction: 0.302795 hartree
zpe.thermalcorrener: 0.321811 hartree
zpe.thermalcorrenthalpy: 0.322755 hartree
zpe.thermalcorrgfe: 0.254674 hartree
zpe.sumelectzpe: -995.820132 hartree
zpe.sumelectthermal: -995.801116 hartree
zpe.sumelectthermalent: -995.800171 hartree
zpe.sumelectthermalfe: -995.868253 hartree
dipole: -3.4422 4.2483 4.5670
dipole: 7.1242
quadrupole: -110.9623 -139.5140 -128.0322
quadrupole: 20.0934 -0.2435 -8.2621
quadrupole: 15.2072 -13.3445 -1.8627 20.0934 -0.2435 -8.2621
hfenergy: -996.1229267 hartree
pointgroup: C01 [X(C20H16O3)]
dipole: 1.3088385 2.4485836 -0.3840017 debye
polarizability: 364.6321843|19.9350667|172.7383179|-24.7487283|-8.4326013|181.6179676 unknown
InChI: InChI=1S/C20H16O3/c1-20(18-6-4-3-5-17(18)19(21)23-20)15-9-7-14-12-16(22-2)10-8-13(14)11-15/h3-12H,1-2H3
charge 0 multiplicity 1
39 atoms
O  -2.270857 -1.651086 -0.956612
O  -4.106526 -2.689674 0.057881
O  6.010136 0.039491 1.019618
C  -1.713585 -0.234209 -1.089333
C  -2.675669 0.58205 -0.221092
C  -0.284395 -0.247686 -0.540456
C  -1.840838 0.131918 -2.578192
C  -3.686787 -0.255484 0.291668
C  0.817009 0.159496 -1.296485
C  -3.454805 -1.653121 -0.1618
C  -0.074664 -0.688488 0.813863
C  -2.665731 1.956161 0.079085
C  2.142805 0.147251 -0.74992
C  2.346931 -0.298498 0.613867
C  -4.723546 0.240407 1.107744
C  1.198591 -0.715408 1.371639
C  -3.70156 2.467296 0.89884
C  -4.722581 1.620717 1.407762
C  3.282428 0.559233 -1.50962
C  3.663987 -0.314865 1.158842
C  4.759097 0.09564 0.385939
C  4.568863 0.538317 -0.964754
C  7.190198 0.446312 0.252769
H  -1.499611 1.166211 -2.761837
H  -1.246573 -0.5615 -3.19588
H  -2.89576 0.056262 -2.889191
H  0.691191 0.495043 -2.33181
H  -0.934436 -1.018815 1.406696
H  -1.87544 2.614647 -0.29692
H  -5.49524 -0.43512 1.490919
H  1.341633 -1.060918 2.401946
H  -3.714762 3.53395 1.149212
H  -5.510284 2.044676 2.039621
H  3.138928 0.895604 -2.543523
H  3.837509 -0.650439 2.186368
H  5.420439 0.858037 -1.572268
H  7.127355 1.508163 -0.055313
H  7.333943 -0.193172 -0.639713
H  8.036605 0.312403 0.94214
