program: Gaussian 09
title: 000156233
version: EM64L-G09RevD.01
frameworkgroup: C1[X(C19H14O4)]
method: RPBEPBE
basis: SDD
operation: Freq
keyword: #pfreq=noraman
keyword: PBEPBE/SDD
title: #p freq=noraman PBEPBE/SDD
converged: YES YES NO NO
title: Mulliken charges:
elementType: O O O O C C C C C C C C C C C C C C C C C C C H H H H H H H H H H H H H H
charge: -0.262246 -0.204069 -0.439612 -0.228902 0.393623 0.407538 0.378453 -0.549657 -0.424325 -0.392644 -0.017198 -0.554914 -0.433387 0.246060 0.327646 -0.367728 0.099610 -0.359650 -0.337501 -0.227765 -0.223198 0.082692 -0.536876 0.255749 0.241172 0.275271 0.265027 0.240268 0.244206 0.264244 0.281243 0.238041 0.237203 0.248840 0.222521 0.222700 0.387561
chargesum: 0.00000
title: Mulliken charges with hydrogens summed into heavy atoms:
elementType: O O O O C C C C C C C C C C C C C C C C C C C
charge: -0.262246 -0.204069 -0.052051 -0.228902 0.393623 0.407538 0.378453 -0.293908 -0.183153 -0.117373 -0.017198 -0.289886 -0.193119 0.246060 0.327646 -0.123522 0.099610 -0.095406 -0.056257 0.010277 0.014006 0.082692 0.157185
polarizability: 3.42783125e+02 1.21214101e+01 2.20662126e+02 -2.68590157e+01 9.13128733e+00 1.60080287e+02
1716.lowfreq: -0.0006 -0.0004 -0.0002 0.5741 3.2823 7.2333 15.3824 31.6963 44.0435
frequency: 15.0699 31.6447 44.0092 48.6082 76.7920 97.5435 111.8570 120.0464 154.0727 179.1811 191.2891 218.5125 227.6204 245.1839 249.7925 301.8558 338.6457 357.7717 361.8945 388.9342 406.5728 412.5000 466.4634 475.2493 496.0863 516.0166 543.1369 550.6932 575.3958 592.6545 597.8091 630.7753 651.3153 663.4889 687.2827 716.6541 726.6124 760.3597 776.7906 781.9666 791.5246 794.9372 811.3646 839.2282 871.2092 896.8043 903.2765 916.3482 922.5096 959.5935 964.1740 975.9552 997.4395 999.7808 1001.4469 1004.7253 1041.1528 1098.9116 1110.8551 1128.8747 1139.6359 1151.3558 1162.6329 1164.8524 1178.2992 1181.6112 1223.7836 1261.6637 1270.8892 1277.2365 1300.5303 1318.6267 1337.6617 1378.3457 1402.2961 1416.1729 1427.1062 1436.8107 1440.8599 1468.9918 1469.8624 1473.7738 1480.3114 1506.0773 1548.7544 1574.0659 1577.1110 1601.5300 1610.3924 1637.5663 1640.9011 2962.6659 3052.6108 3125.9520 3127.1648 3129.0436 3132.3975 3136.2654 3151.4762 3155.1571 3164.9270 3165.8298 3166.7037 3180.6519 3530.2980
redmass: 6.6582 4.5968 5.8611 5.5568 5.9429 5.5045 4.7510 7.0379 5.4648 3.3943 4.1444 4.8251 2.3735 3.6073 2.0430 9.4754 5.7965 5.8919 4.8433 6.1987 3.2008 3.2743 4.9404 2.5472 6.3248 6.7208 3.9656 4.6605 4.2380 1.5163 2.8432 6.2891 3.6661 6.0288 3.7929 5.6815 3.7712 4.7849 2.5816 2.4139 2.0768 4.6266 1.5392 1.5178 5.4328 1.5464 1.7346 1.5684 4.2181 1.4364 3.4990 1.4442 1.3920 4.2670 4.1194 1.4031 2.3663 2.2873 1.2565 1.6914 1.5860 1.7674 1.7485 1.2017 1.0741 1.5144 1.8772 1.9653 1.7076 1.7024 3.6655 2.6197 1.8571 10.3889 3.1422 4.4648 2.2176 1.7744 2.9905 1.1771 1.2816 1.9130 1.9430 4.1402 9.8964 6.9964 7.9064 6.2404 6.0517 8.2487 7.2843 1.0328 1.1042 1.0913 1.0974 1.0908 1.0889 1.0862 1.0911 1.0919 1.0968 1.0958 1.0944 1.0974 1.0642
irintensity: 0.2731 0.0257 1.4736 0.0300 1.8615 9.2937 1.1162 0.8107 1.2896 1.5114 1.8000 7.0172 1.7929 2.0971 1.8445 6.1171 2.5256 4.8691 3.7896 10.9705 1.5086 6.1793 1.1302 17.1120 17.7330 2.7781 4.3142 37.0247 1.6268 91.8440 40.7236 13.2986 0.3085 3.0568 56.0521 5.2578 74.5126 11.8207 17.3098 12.7086 18.9459 3.9838 36.1368 1.7441 37.9428 0.7323 52.8690 12.6759 16.4251 3.6346 7.5771 4.3967 12.6368 135.1509 151.4446 11.9080 5.4246 60.2692 0.2619 18.6247 40.6693 83.5337 71.1030 104.0443 0.3434 71.3087 195.6655 189.9397 11.2226 21.2934 101.8891 77.0091 19.0012 11.5645 4.5483 12.7151 4.4728 5.0569 20.8667 81.5647 97.0214 19.7230 48.9024 9.0334 325.9027 20.1011 19.7238 17.1350 5.3684 296.2736 144.0949 88.4961 46.0994 0.3724 38.2572 5.0772 6.4775 2.1453 10.1494 4.7748 17.0306 8.9930 13.5644 10.8012 47.5944
temp: 298.150 k
press: 1.00000 atm
elementType: 8 8 8 8 6 6 6 6 6 6 6 6 6 6 6 6 6 6 6 6 6 6 6 1 1 1 1 1 1 1 1 1 1 1 1 1 1
symmnumber: 1
zpe: 730075.6 jmol-1
zpe.correction: 0.278071 hartree
zpe.thermalcorrener: 0.297599 hartree
zpe.thermalcorrenthalpy: 0.298543 hartree
zpe.thermalcorrgfe: 0.228183 hartree
zpe.sumelectzpe: -1031.736115 hartree
zpe.sumelectthermal: -1031.716587 hartree
zpe.sumelectthermalent: -1031.715643 hartree
zpe.sumelectthermalfe: -1031.786002 hartree
dipole: -2.2649 -6.1623 -1.2158
dipole: 6.6770
quadrupole: -111.5617 -128.9035 -124.2417
quadrupole: -3.9866 -3.3278 0.6364
quadrupole: 10.0073 -7.3346 -2.6727 -3.9866 -3.3278 0.6364
hfenergy: -1032.0141857 hartree
pointgroup: C01 [X(C19H14O4)]
dipole: -0.8672596 2.4631924 -0.2850462 debye
polarizability: 340.0953191|-4.0179273|220.6444784|36.4310449|-9.6549401|162.7857411 unknown
InChI: InChI=1S/C19H14O4/c1-23-15-9-8-12-10-14(7-6-13(12)11-15)18(20)16-4-2-3-5-17(16)19(21)22/h2-11,21H,1H3
charge 0 multiplicity 1
37 atoms
O  -5.875787 0.417211 -0.404341
O  2.284151 -2.419751 1.241491
O  2.798662 0.82737 -2.886177
O  1.98329 -1.133479 -1.954307
C  -1.67791 0.218972 0.226599
C  -2.49646 -0.978123 0.154285
C  0.33182 -1.166537 0.57285
C  -0.269126 0.093314 0.433466
C  -1.854616 -2.258726 0.303916
C  -0.484745 -2.351106 0.511603
C  1.792198 -1.325432 0.830212
C  -3.898665 -0.853493 -0.059155
C  -2.314378 1.493239 0.08425
C  2.704299 -0.111577 0.720396
C  -4.48956 0.411616 -0.197163
C  -3.690641 1.60112 -0.124434
C  3.032967 0.53808 -0.506805
C  3.27618 0.372594 1.921866
C  3.891928 1.668988 -0.504806
C  4.128088 1.49872 1.91863
C  4.430976 2.154976 0.702564
C  2.545031 -0.0236 -1.795881
C  -6.547357 1.711317 -0.555856
H  0.338196 1.004603 0.493766
H  -2.468085 -3.165393 0.247946
H  0.013766 -3.318329 0.628919
H  -4.534517 -1.742673 -0.118184
H  -1.701628 2.400956 0.139365
H  -4.148819 2.588569 -0.231111
H  3.047397 -0.143362 2.859899
H  4.135858 2.142755 -1.459352
H  4.555363 1.859614 2.860538
H  5.093177 3.02704 0.695593
H  -7.608166 1.464081 -0.707154
H  -6.16545 2.264251 -1.435718
H  -6.436608 2.332797 0.353615
H  2.474671 0.381502 -3.714224
