program: Gaussian 09
title: 000156232
version: EM64L-G09RevD.01
frameworkgroup: C1[X(C14H11NO2)]
method: RPBEPBE
basis: SDD
operation: Freq
keyword: #p
keyword: freq=noraman
keyword: PBEPBE/SDD
title: #p freq=noraman PBEPBE/SDD
converged: YES YES NO NO
title: Mulliken charges:
elementType: O O N C C C C C C C C C C C C C C H H H H H H H H H H H
charge: -0.309415 -0.423435 0.003531 0.432744 0.353174 -0.479149 -0.235635 -0.460285 -0.391365 -0.182292 0.347962 -0.356505 -0.385149 -0.202256 -0.193101 -0.247196 -0.131644 0.305635 0.234716 0.240191 0.264640 0.236138 0.268439 0.257094 0.235046 0.231323 0.232728 0.354066
chargesum: 0.00000
title: Mulliken charges with hydrogens summed into heavy atoms:
elementType: O O N C C C C C C C C C C C C C C
charge: -0.309415 -0.069369 0.003531 0.432744 0.353174 -0.173514 -0.000919 -0.220094 -0.126725 0.053846 0.347962 -0.088066 -0.128056 0.032790 0.038221 -0.014468 -0.131644
polarizability: 2.01388006e+02 2.26456049e+01 1.66787265e+02 -1.63804426e+01 9.37913092e+00 1.08104037e+02
1716.lowfreq: -11.4402 -5.2459 -1.7160 -0.0002 0.0005 0.0006 22.2347 29.6922 41.0047
frequency: 21.8753 29.6614 40.9226 55.8148 96.4205 137.6137 193.1201 213.1341 229.9317 250.6779 284.5526 304.6187 339.2020 380.3944 406.8689 411.2615 459.5123 480.2605 553.3041 562.1189 589.9811 610.9672 627.3340 638.7655 691.5733 696.9748 722.3820 764.4028 798.3711 817.3100 836.3592 891.1801 899.0736 912.7254 917.4753 947.9231 962.1972 971.0224 978.6831 986.2758 987.4218 990.6473 1019.4062 1078.2017 1084.2267 1135.9697 1166.7375 1173.0588 1174.2103 1191.3716 1209.6454 1234.4441 1265.0286 1304.4473 1312.3911 1353.4960 1381.6204 1393.4189 1437.7218 1443.5017 1469.7048 1476.8553 1594.0478 1596.1571 1603.4983 1613.0651 2205.7319 2960.3361 3131.5114 3134.3585 3143.3721 3153.4358 3156.3564 3158.5874 3166.4169 3175.5863 3175.9947 3549.2600
redmass: 7.0087 5.0224 4.8955 5.5240 6.6100 5.6067 6.1172 4.6247 4.7395 1.1692 5.4805 5.3078 6.0370 5.0679 6.0169 3.1387 3.4664 3.4071 7.0697 7.6747 6.0871 6.4369 6.1534 6.6408 2.2875 2.2906 4.1569 1.6502 1.5425 6.0064 1.2689 1.7768 1.4345 1.8461 2.0054 3.8343 4.2558 1.3645 1.3468 5.9873 5.5071 1.3428 2.1025 1.5164 1.6262 1.8472 1.2599 1.1345 1.1753 1.8698 1.1256 2.4422 1.6198 1.3195 1.2961 1.5826 8.3545 7.8119 2.5518 2.4353 2.2901 2.5009 6.2086 6.5727 6.5946 6.5571 12.5950 1.0829 1.0884 1.0851 1.0890 1.0922 1.0930 1.0923 1.0965 1.0983 1.1006 1.0661
irintensity: 5.0649 0.5599 0.1902 3.8275 2.0790 0.3830 2.4218 0.8383 0.1319 189.4586 2.9659 1.7998 8.0040 6.1574 3.1079 0.3585 7.6874 16.9141 6.8653 0.4827 1.9668 0.5963 2.5768 8.5924 42.2043 21.1726 3.0633 100.9845 54.7740 35.8050 1.2316 23.2661 3.4559 5.3506 3.4220 78.6998 39.1418 0.0939 0.2476 1.7213 0.8602 0.7737 12.9963 11.1398 4.4688 4.8031 48.1409 28.5431 6.9711 65.8643 58.1964 252.0915 83.2206 1.5215 0.8747 45.8312 6.1628 14.2427 34.7409 30.8195 180.7012 16.7376 52.3828 95.1442 38.2114 3.1679 0.9844 28.5180 4.7676 1.5236 7.6286 19.5083 13.3598 8.7364 12.8410 11.0366 4.7166 14.2028
temp: 298.150 k
press: 1.00000 atm
elementType: 8 8 7 6 6 6 6 6 6 6 6 6 6 6 6 6 6 1 1 1 1 1 1 1 1 1 1 1
symmnumber: 1
zpe: 553353.5 jmol-1
zpe.correction: 0.210761 hartree
zpe.thermalcorrener: 0.225641 hartree
zpe.thermalcorrenthalpy: 0.226586 hartree
zpe.thermalcorrgfe: 0.166438 hartree
zpe.sumelectzpe: -744.060531 hartree
zpe.sumelectthermal: -744.045650 hartree
zpe.sumelectthermalent: -744.044706 hartree
zpe.sumelectthermalfe: -744.104854 hartree
dipole: 0.4903 3.7225 1.2901
dipole: 3.9701
quadrupole: -80.9107 -108.5219 -98.3576
quadrupole: 15.5228 0.2990 -1.2507
quadrupole: 15.0194 -12.5918 -2.4275 15.5228 0.2990 -1.2507
hfenergy: -744.2712918 hartree
pointgroup: C01 [X(C14H11N1O2)]
dipole: 0.2193811 1.4129547 0.6286318 debye
polarizability: 200.1211085|24.5643957|164.6054387|-17.9013684|13.502968|111.5527602 unknown
InChI: InChI=1S/C14H11NO2/c15-10-14(16)11-5-4-8-13(9-11)17-12-6-2-1-3-7-12/h1-9,14,16H
charge 0 multiplicity 1
28 atoms
O  -1.138886 1.687122 0.261565
O  2.737942 -1.752909 1.53833
N  2.222907 -2.96473 -1.601522
C  2.29107 0.175918 0.006618
C  0.238121 1.490419 0.031746
C  0.890754 0.250767 0.206102
C  3.00501 -1.161624 0.210324
C  3.030412 1.327951 -0.346317
C  0.968263 2.652883 -0.317215
C  2.361843 2.565536 -0.50233
C  -2.074061 0.621422 0.125378
C  -2.012558 -0.310664 -0.93571
C  -3.137856 0.609532 1.052143
C  -3.031727 -1.282315 -1.04936
C  -4.153233 -0.363593 0.920743
C  -4.101884 -1.315374 -0.124853
C  2.565543 -2.173476 -0.778786
H  0.333216 -0.645734 0.495015
H  4.097036 -1.009676 0.069895
H  4.113532 1.262347 -0.501338
H  0.430388 3.598003 -0.435824
H  2.928062 3.462478 -0.773785
H  -1.195273 -0.278219 -1.663095
H  -3.156782 1.356309 1.85152
H  -2.987581 -2.009959 -1.866792
H  -4.981308 -0.378431 1.637685
H  -4.887947 -2.071666 -0.220126
H  2.830998 -1.030315 2.21249
