program: Gaussian 09
title: 000156228
version: EM64L-G09RevD.01
frameworkgroup: C1[X(C13H13Cl2NO3)]
method: RPBEPBE
basis: SDD
operation: Freq
keyword: #p
keyword: freq=noraman
keyword: PBEPBE/SDD
title: #p freq=noraman PBEPBE/SDD
converged: YES YES NO NO
title: Mulliken charges:
elementType: Cl Cl O O O N C C C C C C C C C C C C C H H H H H H H H H H H H H
charge: -0.042373 -0.049197 -0.447328 -0.230469 -0.223425 -0.456234 0.128648 0.191036 -0.629721 -0.743353 -0.738422 0.130898 0.140826 0.560331 -0.471071 -0.301203 -0.069902 -0.025926 -0.270580 0.236825 0.281617 0.216391 0.253166 0.259995 0.262313 0.211857 0.232036 0.328583 0.385709 0.255662 0.338099 0.285212
chargesum: 0.00000
title: Mulliken charges with hydrogens summed into heavy atoms:
elementType: Cl Cl O O O N C C C C C C C C C C C C C
charge: -0.042373 -0.049197 -0.061619 -0.230469 -0.223425 -0.127651 0.128648 0.191036 -0.111280 -0.013801 -0.032216 0.130898 0.140826 0.560331 -0.215409 0.036896 -0.069902 -0.025926 0.014632
polarizability: 2.57526424e+02 -8.77991881e+00 1.86383539e+02 -5.70904120e+00 -2.32738556e+00 1.06981686e+02
1716.lowfreq: -2.9351 -0.0028 -0.0022 -0.0012 4.7762 9.5100 22.8190 31.9235 50.9854
frequency: 22.5842 31.5617 50.9781 63.7799 79.0765 112.9276 131.6979 144.0702 163.4260 181.6785 196.3761 204.4055 211.8790 225.4910 247.1541 266.2503 276.8232 303.7433 335.9238 374.2658 400.8657 412.0806 424.2615 434.3957 481.1495 495.6720 516.0081 547.3220 571.2909 580.0540 611.9269 670.6662 674.2113 680.2134 722.3508 736.8408 753.2555 780.6523 841.4675 848.6651 859.5391 893.2581 907.9721 922.1725 924.2141 946.8360 976.6699 984.7174 1028.9443 1060.1905 1089.5476 1091.9538 1094.6937 1106.1104 1133.9764 1157.1669 1210.9481 1250.4258 1259.2632 1267.9054 1315.8138 1350.5256 1370.0758 1391.3820 1403.0709 1407.2242 1446.8014 1450.0477 1465.9484 1472.8301 1478.6515 1481.9643 1495.5921 1575.3361 1604.1971 1612.0123 1650.0849 2990.0979 2999.8980 3078.8319 3084.7190 3093.9315 3107.3142 3120.9965 3152.2775 3192.5553 3200.0950 3201.1205 3518.4379 3529.5572
redmass: 5.8718 7.3511 7.4610 8.4996 8.0610 6.1772 6.9131 6.3172 4.1540 1.8293 2.8813 4.7656 1.4354 2.2526 3.2183 4.0335 4.1102 3.8448 3.6416 12.5815 2.8532 7.0694 4.1399 3.8003 5.7990 3.9305 5.2478 4.3673 4.0436 2.0383 1.9999 1.2897 2.4070 3.5121 5.5929 5.1339 9.8694 4.2206 3.8532 1.4221 1.5694 3.2142 4.3485 1.6210 1.4614 1.4610 5.7964 1.5876 2.2581 1.3852 1.5647 1.4990 1.4902 1.8619 2.5457 3.5606 2.1141 1.2794 2.6611 2.3043 4.4326 3.4495 4.9253 1.1996 3.9477 1.2001 3.4281 1.2001 1.0503 1.0531 1.1023 1.0509 2.2382 5.8723 6.3669 6.0248 8.2728 1.0375 1.0362 1.0977 1.0597 1.0995 1.0996 1.0993 1.0928 1.0938 1.0939 1.1124 1.0641 1.0761
irintensity: 0.3612 1.0860 0.2385 0.2661 4.0240 1.0221 2.3193 1.3845 0.2789 0.1922 1.1786 0.0630 0.8173 0.4069 0.3726 2.8099 4.6640 4.0208 3.6449 9.3094 3.0878 8.7431 4.4137 3.5787 9.6839 46.9363 0.0738 3.7887 3.3341 59.6833 63.7335 50.4528 37.4755 9.2028 17.4332 21.2084 65.6849 5.2489 19.6121 27.8480 35.4708 43.2840 20.8827 35.3372 23.7858 11.5791 5.7899 53.7420 246.3727 22.1245 31.2808 23.1184 2.9188 37.5907 82.8178 4.7103 39.0614 2.2003 0.4486 45.0057 42.2162 42.7450 132.6783 14.4626 70.5660 13.8359 121.9262 13.5711 15.7938 12.9348 7.3287 14.6194 357.1421 229.7943 191.3217 88.5870 318.2775 26.5330 14.7877 14.6164 10.4759 30.8792 8.2736 3.3046 2.5615 3.4647 20.1839 5.4210 37.2678 19.2897
temp: 298.150 k
press: 1.00000 atm
elementType: 17 17 8 8 8 7 6 6 6 6 6 6 6 6 6 6 6 6 6 1 1 1 1 1 1 1 1 1 1 1 1 1
symmnumber: 1
zpe: 617364.8 jmol-1
zpe.correction: 0.235142 hartree
zpe.thermalcorrener: 0.254303 hartree
zpe.thermalcorrenthalpy: 0.255248 hartree
zpe.thermalcorrgfe: 0.186106 hartree
zpe.sumelectzpe: -1702.331094 hartree
zpe.sumelectthermal: -1702.311932 hartree
zpe.sumelectthermalent: -1702.310988 hartree
zpe.sumelectthermalfe: -1702.380130 hartree
dipole: -1.7797 -4.7939 0.8983
dipole: 5.1919
quadrupole: -127.8355 -131.5225 -125.2341
quadrupole: 11.8322 -8.3146 0.2787
quadrupole: 0.3618 -3.3251 2.9633 11.8322 -8.3146 0.2787
hfenergy: -1702.5662357 hartree
pointgroup: C01 [X(C13H13Cl2N1O3)]
dipole: 0.6799976 1.9161568 -0.1959848 debye
polarizability: 257.538564|-5.7622681|181.0132801|9.3013398|-19.7783845|112.3398054 unknown
InChI: InChI=1S/C13H13Cl2NO3/c1-12(6-13(12,2)11(18)19)10(17)16-9-4-7(14)3-8(15)5-9/h3-5,16,18H,6H2,1-2H3
charge 0 multiplicity 1
32 atoms
Cl -4.2778 -2.868034 0.777762
Cl -5.126026 2.296546 -1.078627
O  5.100339 0.95952 0.220726
O  0.579015 -1.401179 0.936511
O  5.168076 -1.181893 -0.659918
N  -0.355943 0.574837 0.071243
C  2.065233 0.484574 0.481401
C  3.035131 0.013806 -0.666711
C  2.432725 1.440575 -0.654383
C  2.565238 0.734008 1.907097
C  2.515745 -1.003799 -1.681299
C  0.710599 -0.220264 0.504625
C  4.494894 -0.164402 -0.3796
C  -1.738078 0.253429 0.019471
C  -2.625725 1.269018 -0.432014
C  -2.241036 -1.022036 0.394125
C  -3.62628 -1.23736 0.301267
C  -3.998861 0.988474 -0.500329
C  -4.540926 -0.260589 -0.140694
H  1.721926 1.650207 -1.462959
H  3.105908 2.265431 -0.408356
H  1.863294 1.400008 2.442892
H  2.619055 -0.220174 2.459639
H  3.558885 1.207109 1.904194
H  2.586308 -2.027173 -1.277772
H  1.460166 -0.807168 -1.93702
H  3.111411 -0.95965 -2.609709
H  -0.105093 1.523924 -0.216087
H  6.062388 0.753275 0.370958
H  -2.252119 2.256567 -0.721684
H  -1.55858 -1.797085 0.744575
H  -5.612567 -0.460702 -0.200523
