program: Gaussian 09
title: 000156131
version: EM64L-G09RevD.01
frameworkgroup: C1[X(C21H18Cl3O3P)]
method: RPBEPBE
basis: SDD
operation: Freq
keyword: #p
keyword: freq=noraman
keyword: PBEPBE/SDD
title: #p freq=noraman PBEPBE/SDD
converged: YES YES NO NO
title: Mulliken charges:
elementType: Cl Cl Cl P O O O C C C C C C C C C C C C C C C C C C C C C H H H H H H H H H H H H H H H H H H
charge: -0.052991 -0.054219 -0.054202 1.013210 -0.530487 -0.525422 -0.535171 0.580816 0.576634 0.580518 0.315416 0.367016 0.346325 -0.559026 -0.547542 -0.541644 -0.312431 -0.311457 -0.308201 -0.337252 -0.365750 -0.333580 -0.188342 -0.177034 -0.199529 -0.792355 -0.792378 -0.792277 0.263641 0.270335 0.263108 0.293058 0.249516 0.250969 0.260760 0.256771 0.257450 0.249403 0.246124 0.226020 0.228113 0.248981 0.245261 0.226546 0.247782 0.247517
chargesum: 0.00000
title: Mulliken charges with hydrogens summed into heavy atoms:
elementType: Cl Cl Cl P O O O C C C C C C C C C C C C C C C C C C C C C
charge: -0.052991 -0.054219 -0.054202 1.013210 -0.530487 -0.525422 -0.535171 0.580816 0.576634 0.580518 0.315416 0.367016 0.346325 -0.295385 -0.277206 -0.278536 -0.312431 -0.311457 -0.308201 -0.044194 -0.116234 -0.082611 0.072418 0.079737 0.057921 -0.070808 -0.070022 -0.070432
polarizability: 4.31117801e+02 9.94185461e+00 2.85044827e+02 2.24202858e+01 1.38541179e+01 2.09446115e+02
1716.lowfreq: -7.6818 -3.9108 -0.0029 -0.0028 -0.0024 1.3007 4.2851 6.2471 12.6660
frequency: -4.1040 3.8049 12.6465 14.4939 18.3195 20.2643 49.3760 59.6391 62.6625 91.9848 104.7831 109.3176 113.9167 123.2605 128.9833 139.3885 163.0478 182.4837 209.9999 212.5899 225.5804 227.2498 229.5160 233.1869 278.9616 284.8634 305.6633 319.5299 325.1280 329.1898 358.7509 373.6542 389.1693 442.1625 442.4610 443.5688 467.9014 470.8231 473.8241 508.9911 515.2092 534.5427 549.4577 551.7391 557.4073 575.4575 584.6523 610.0036 650.4459 668.8876 679.4761 701.3481 701.4939 702.7956 726.3469 734.2609 751.8843 803.3953 805.4665 821.6749 882.5790 888.7386 889.1972 928.8670 929.7695 932.8631 933.1570 942.5046 950.0213 999.4377 1000.2771 1001.3428 1022.7404 1023.0639 1024.6425 1045.8498 1046.3290 1046.5806 1127.5977 1130.5566 1132.1386 1138.7436 1141.6888 1155.7474 1226.4760 1227.5993 1231.7722 1261.6418 1263.8604 1267.6716 1366.0834 1366.9801 1367.8091 1392.8313 1394.7156 1396.4655 1402.4724 1403.4990 1403.8443 1453.4202 1454.0952 1455.7788 1460.6907 1460.9696 1461.2143 1475.7545 1476.2531 1477.9563 1572.7486 1574.1815 1576.1842 1603.7181 1605.4108 1607.7388 2987.1076 2987.2641 2987.6685 3066.3355 3066.6937 3067.2352 3098.7164 3099.9217 3100.0542 3147.7829 3151.0639 3156.5898 3156.6514 3163.4766 3165.3264 3172.8192 3174.4555 3185.3878
redmass: 5.8105 6.8390 3.9568 5.3681 10.9059 5.7679 7.3884 9.1938 9.3911 7.1171 1.2198 3.8931 1.0599 1.0469 8.0400 6.8283 6.2888 4.2919 3.6333 3.7110 5.4808 5.6676 5.7133 5.1124 4.9976 5.0196 6.3008 8.0439 7.0564 11.6885 7.8825 9.1585 9.7449 2.9452 2.9455 2.9439 3.9443 4.0075 4.1394 6.6122 6.8732 5.5936 6.0710 5.8900 4.5743 3.9762 4.3397 6.6706 8.6728 8.6422 8.2744 3.4505 3.4594 3.4951 6.8937 7.4219 7.2297 1.3812 1.3875 1.3412 1.4231 1.4154 1.4140 3.3653 3.4630 1.4187 1.3514 3.0226 1.3630 1.6828 1.6997 1.7871 4.2424 4.3830 4.0281 1.5266 1.5287 1.5275 1.4438 1.4643 1.3987 1.7527 1.7408 1.7858 2.7588 2.6281 2.4420 1.5007 1.5346 1.6920 8.9679 9.1844 9.0496 3.0750 3.0433 3.0909 1.2366 1.2316 1.2276 2.5939 2.5407 2.3865 1.0449 1.0448 1.0448 1.1968 1.2129 1.2587 6.4474 6.4776 6.6036 7.6134 7.5907 7.5301 1.0371 1.0371 1.0371 1.0972 1.0972 1.0972 1.0998 1.0998 1.0998 1.0895 1.0892 1.0924 1.0923 1.0896 1.0925 1.0967 1.0971 1.0971
irintensity: 0.1219 0.0258 0.0369 0.0691 0.2367 0.0616 0.4741 0.6343 0.2744 0.1917 0.3401 0.8060 0.7076 0.7408 0.1540 1.7840 1.2406 2.2300 2.7804 6.9223 1.3036 1.6032 2.9131 7.6882 0.8792 1.8974 3.1690 7.6328 5.0356 20.1063 2.3543 12.6381 1.8789 16.3248 7.2546 8.7546 2.0973 3.2323 0.8382 18.4467 43.8395 5.3007 19.1169 3.1601 22.0128 7.1112 4.5133 19.8317 143.6586 235.2748 30.1463 1.0812 0.0265 0.9748 42.4181 162.7144 17.8114 47.9147 47.0165 37.7145 21.7165 22.3445 21.1685 66.2721 149.6050 13.2016 0.2265 4.9482 7.0408 34.6489 13.2854 5.2402 105.1112 181.9151 24.0606 9.0882 12.6049 7.9922 111.3906 76.4130 46.7040 86.6675 206.6316 7.1296 64.2685 69.8697 7.9630 35.3074 61.3093 8.4501 1.4438 0.5921 0.6394 29.5811 64.5210 4.9108 23.7221 31.3691 18.5474 112.5315 120.1625 24.8263 11.0167 15.6610 16.2982 93.7854 155.9514 52.3141 18.7799 39.8822 0.8198 49.6861 11.0829 27.2584 22.6783 14.6459 16.8439 11.9353 12.5601 11.2701 15.4755 14.6170 15.2088 7.1421 9.1125 3.1418 3.9718 1.1090 1.9282 1.7372 2.4665 0.1789
temp: 298.150 k
press: 1.00000 atm
elementType: 17 17 17 15 8 8 8 6 6 6 6 6 6 6 6 6 6 6 6 6 6 6 6 6 6 6 6 6 1 1 1 1 1 1 1 1 1 1 1 1 1 1 1 1 1 1
symmnumber: 1
zpe: 867985.9 jmol-1
zpe.correction: 0.330598 hartree
zpe.thermalcorrener: 0.358823 hartree
zpe.thermalcorrenthalpy: 0.359767 hartree
zpe.thermalcorrgfe: 0.264868 hartree
zpe.sumelectzpe: -2756.135601 hartree
zpe.sumelectthermal: -2756.107377 hartree
zpe.sumelectthermalent: -2756.106433 hartree
zpe.sumelectthermalfe: -2756.201332 hartree
dipole: 0.4061 -0.0108 -1.0598
dipole: 1.1350
quadrupole: -198.1340 -201.6757 -180.3715
quadrupole: 7.3156 13.7999 9.1065
quadrupole: -4.7402 -8.2820 13.0222 7.3156 13.7999 9.1065
hfenergy: -2756.4661997 hartree
pointgroup: C01 [X(C21H18Cl3O3P1)]
dipole: 0.1760056 -0.070984 -0.4041992 debye
polarizability: 420.7146373|-30.4246871|292.0079204|39.5282151|0.8476275|212.8861846 unknown
InChI: InChI=1S/C21H18Cl3O3P/c1-13-10-16(4-7-19(13)22)25-28(26-17-5-8-20(23)14(2)11-17)27-18-6-9-21(24)15(3)12-18/h4-12H,1-3H3
charge 0 multiplicity 1
46 atoms
Cl -6.969263 1.687782 0.026238
Cl 6.412753 -3.29606 -0.139013
Cl 1.881128 5.864057 -0.999211
P  -0.315304 -0.9415 -0.630784
O  -1.865913 -1.521915 -0.023159
O  0.475679 -2.291873 0.191569
O  0.052499 0.338586 0.590416
C  -5.319748 -0.389221 -0.894745
C  4.004257 -2.872615 1.241774
C  2.155107 3.413814 0.346129
C  -3.031019 -0.708915 -0.042489
C  1.878099 -2.474781 0.06503
C  0.46901 1.626089 0.162544
C  -4.091785 -1.097909 -0.8890
C  2.611242 -2.612411 1.26266
C  1.690176 2.116494 0.674826
C  -5.416142 0.721539 -0.018678
C  4.6154 -2.969896 -0.033986
C  1.340329 4.181744 -0.524774
C  -3.156926 0.394595 0.831816
C  2.509138 -2.58739 -1.194414
C  -0.328526 2.417795 -0.695383
C  -4.368687 1.11855 0.833825
C  3.899046 -2.832191 -1.237388
C  0.120987 3.710004 -1.044234
C  -6.46155 -0.812855 -1.794386
C  4.785774 -3.03227 2.528513
C  3.463957 3.936675 0.898977
H  -3.959358 -1.969335 -1.53808
H  2.080483 -2.519712 2.214943
H  2.280066 1.473439 1.33592
H  -2.334352 0.663666 1.49942
H  1.933505 -2.506601 -2.122075
H  -1.291069 2.048926 -1.065332
H  -4.498573 1.975824 1.500306
H  4.415401 -2.924878 -2.196992
H  -0.47604 4.343521 -1.706214
H  -7.35838 -1.072485 -1.202535
H  -6.759209 0.005409 -2.475308
H  -6.181492 -1.688519 -2.402703
H  4.130388 -2.90864 3.40604
H  5.258814 -4.02976 2.584444
H  5.603698 -2.291662 2.594544
H  3.94224 3.190423 1.5542
H  4.168016 4.188807 0.084954
H  3.308445 4.863956 1.480097
