program: Gaussian 09
title: 000156068
version: EM64L-G09RevD.01
frameworkgroup: C1[X(C23H25N5O4)]
method: RPBEPBE
basis: SDD
operation: Freq
keyword: #p
keyword: freq=noraman
keyword: PBEPBE/SDD
title: #p freq=noraman PBEPBE/SDD
converged: NO YES NO NO
title: Mulliken charges:
elementType: O O O O N N N N N C C C C C C C C C C C C C C C C C C C C C C C H H H H H H H H H H H H H H H H H H H H H H H H H
charge: -0.210104 -0.453255 -0.286769 -0.316061 -0.254208 -0.109864 -0.418145 -0.421407 -0.071475 0.271864 0.104858 0.168295 -0.570461 0.183119 -0.177645 0.243506 0.080099 -0.788283 -0.745252 0.358409 -0.106866 0.074140 -0.358840 -0.377766 -0.289430 -0.403759 -0.214353 -0.621531 -0.531226 0.354735 -0.421471 -0.242226 0.240846 0.266723 0.272983 0.353583 0.222509 0.262178 0.223094 0.226120 0.249461 0.232589 0.255388 0.237185 0.260872 0.373401 0.230242 0.302748 0.231635 0.221179 0.241017 0.235893 0.252448 0.242700 0.388852 0.264718 0.263009
chargesum: 0.00000
title: Mulliken charges with hydrogens summed into heavy atoms:
elementType: O O O O N N N N N C C C C C C C C C C C C C C C C C C C C C C C
charge: -0.210104 -0.079854 -0.286769 -0.316061 -0.254208 -0.109864 -0.064562 -0.032555 -0.071475 0.271864 0.104858 0.168295 -0.062891 0.183119 0.095338 0.243506 0.080099 -0.080501 -0.037083 0.358409 0.148522 0.074140 -0.121655 -0.116894 -0.059188 -0.101012 0.017282 -0.159335 0.199815 0.354735 -0.156752 0.020783
polarizability: 4.78476464e+02 1.05607422e+01 2.59271995e+02 2.37332419e+00 -7.30619503e+00 2.33134928e+02
1716.lowfreq: -3.1680 0.0001 0.0004 0.0006 3.6553 11.8813 23.6477 29.4484 58.2931
frequency: 23.5952 29.3727 58.2914 71.8609 75.3451 84.8674 92.6371 98.8267 108.7645 117.0660 118.4271 124.9271 145.0496 162.0870 168.2648 188.6509 195.2157 210.8815 225.3472 242.9375 257.1516 259.5847 267.7256 278.3965 294.1819 297.9576 307.5567 315.9970 328.5882 338.1816 346.0121 358.6592 377.0470 387.8908 398.4396 402.6325 433.6063 441.9146 446.0624 452.1316 473.6345 477.9962 518.0744 539.5064 571.3952 589.7933 610.8220 632.0184 639.1940 641.5575 666.0117 668.9713 672.3928 697.0759 701.5560 735.8041 741.6548 749.5912 755.9319 766.8362 784.1463 791.6202 811.1488 814.1207 825.7513 839.7557 854.2056 861.9527 891.0160 896.1500 921.0400 933.1094 937.9156 943.3307 959.0660 967.1440 976.7425 978.3252 995.3610 997.0159 1003.5995 1005.4732 1017.5818 1025.9898 1031.9239 1035.4851 1043.3548 1054.4739 1072.9049 1082.0786 1103.2106 1111.5637 1122.1129 1128.5262 1136.8488 1143.2007 1146.7172 1155.8393 1162.6603 1171.8258 1181.9649 1197.2179 1222.3694 1241.3679 1249.6246 1257.8200 1273.4188 1276.5061 1290.4909 1308.3176 1311.1001 1318.3083 1344.3177 1352.9786 1360.9245 1373.6212 1382.7884 1399.5383 1401.8374 1404.2930 1411.5874 1413.7963 1423.7144 1426.7765 1446.9712 1450.8792 1459.2014 1464.9166 1469.5966 1476.9148 1480.0889 1491.7142 1503.1182 1517.3635 1583.9815 1597.5215 1609.5299 1612.7571 1639.9761 1652.3942 2990.7408 2995.1235 2997.9087 3004.1361 3024.5189 3081.1151 3083.4504 3088.2994 3091.4510 3101.4150 3103.6135 3109.8264 3121.1341 3127.3980 3136.4698 3144.7702 3152.9142 3154.1577 3166.0901 3176.6679 3198.5995 3220.1948 3242.8735 3408.1405 3503.5670
redmass: 5.4346 5.8452 4.6673 4.8104 4.1897 3.0459 5.1647 6.6432 4.1065 2.9923 2.3289 2.1364 5.5653 2.7788 3.7821 1.8246 3.1050 2.7598 2.7864 3.2489 1.7535 4.2698 3.3206 5.2671 3.6762 5.8112 4.1602 3.9382 3.2568 2.8586 3.6203 4.1463 5.5729 3.3186 4.7494 3.4197 1.8403 3.0267 2.0780 3.4004 3.7156 6.9364 3.6023 5.3533 2.4960 2.4525 1.7836 5.3509 4.5271 3.4108 4.7450 4.7052 4.2362 2.2216 4.0307 3.9063 8.6245 3.7127 1.3792 5.1275 3.5381 4.2630 1.4324 4.4432 1.5338 5.3668 5.3086 1.4060 3.8733 6.2271 1.9644 1.4885 1.4907 1.3738 1.3767 4.1545 2.3018 1.7335 3.9629 1.8319 1.0961 1.6663 3.9300 1.6036 1.9035 3.0162 2.4668 2.3179 3.4912 1.2320 2.7639 2.4149 2.1808 3.3622 3.2467 1.5611 1.7172 2.3680 1.9813 1.3186 1.8961 1.8452 1.8107 3.2073 1.4313 2.7555 3.7372 1.7969 1.3176 1.3476 2.3570 1.6702 1.6175 4.0218 1.9172 1.7709 1.1903 1.8077 1.2219 2.0339 3.2951 2.1891 2.7484 1.2069 1.2122 1.9847 1.1674 1.8910 1.0795 1.1893 1.0624 1.0597 1.0731 4.3255 9.1384 6.9901 6.7439 7.4497 4.5009 6.5076 1.0283 1.0820 1.0359 1.0387 1.0605 1.0971 1.0796 1.0972 1.1017 1.0738 1.1048 1.0987 1.0972 1.1049 1.0858 1.0895 1.0902 1.0946 1.0945 1.0982 1.1139 1.0978 1.0997 1.0644 1.0809
irintensity: 0.2022 0.0656 1.3363 0.9940 0.7913 0.0880 0.3378 2.0120 0.5410 0.1571 1.2375 3.2275 1.9662 1.0095 1.3962 1.5325 1.5776 3.2405 5.6117 1.0742 3.0505 6.1292 3.4825 4.5210 4.3819 20.8069 8.5029 6.3097 3.0315 0.2825 1.5277 6.3156 16.1141 2.0868 6.5948 8.1079 35.2476 14.3601 36.4274 22.8882 19.8770 29.8361 3.4242 1.5771 5.7657 31.8722 97.3718 3.7025 8.8381 25.1044 15.4533 0.7724 10.3968 21.9461 27.2507 9.1205 4.3267 36.7450 50.6841 30.1165 7.2764 2.1272 37.3445 20.6292 2.4468 5.8019 26.0973 6.4906 62.8848 2.7900 3.0106 1.7871 8.7639 19.0133 69.4711 42.4655 21.8792 13.7419 25.4860 1.3591 86.2993 44.9106 27.7382 31.1154 50.3323 45.7257 20.3823 15.1014 84.1288 0.0950 112.5946 18.2716 24.0167 75.6319 10.2187 3.0337 17.6903 62.4828 35.9915 14.9266 23.7835 18.7509 5.7042 5.7490 14.6789 135.1814 239.9073 13.8713 15.8293 10.6036 57.0278 84.1913 231.8998 34.0265 167.0887 303.5810 29.7195 23.2390 5.8234 9.7950 84.0676 177.5102 119.1714 25.1386 7.0021 30.3326 15.3729 65.8965 7.6513 2.3580 3.4025 25.0966 20.7795 23.7086 149.6699 26.4839 141.0013 63.8213 21.7273 222.9364 28.8679 9.9437 18.4449 21.5325 27.2848 5.6792 5.2814 35.1405 19.5998 4.1486 22.9833 24.7698 13.4712 12.0825 3.1168 5.4999 18.4758 353.7590 15.3262 19.2039 15.5639 2.5272 0.7615 46.8609 259.9979
temp: 298.150 k
press: 1.00000 atm
elementType: 8 8 8 8 7 7 7 7 7 6 6 6 6 6 6 6 6 6 6 6 6 6 6 6 6 6 6 6 6 6 6 6 1 1 1 1 1 1 1 1 1 1 1 1 1 1 1 1 1 1 1 1 1 1 1 1 1
symmnumber: 1
zpe: 1177259.5 jmol-1
zpe.correction: 0.448394 hartree
zpe.thermalcorrener: 0.477255 hartree
zpe.thermalcorrenthalpy: 0.478199 hartree
zpe.thermalcorrgfe: 0.390921 hartree
zpe.sumelectzpe: -1463.717688 hartree
zpe.sumelectthermal: -1463.688827 hartree
zpe.sumelectthermalent: -1463.687883 hartree
zpe.sumelectthermalfe: -1463.775161 hartree
dipole: 7.1074 -5.5297 0.0812
dipole: 9.0055
quadrupole: -215.1127 -196.6726 -176.4224
quadrupole: -1.0534 2.2191 -0.9963
quadrupole: -19.0435 -0.6034 19.6468 -1.0534 2.2191 -0.9963
hfenergy: -1464.1660823 hartree
pointgroup: C01[X(C23H25N5O4)]
dipole: -2.6620528 2.3349242 -0.1217399 debye
polarizability: 478.7383299|-2.5673854|259.0970907|7.6360442|6.7759408|233.0479672 unknown
InChI: InChI=1S/C23H25N5O4/c1-5-21(2,3)22-11-18(29)20(31)27-17(10-14-12-24-13-25-14)19(30)26-23(22,27)28(32-4)16-9-7-6-8-15(16)22/h5-10,12-13,18,25-26,29H,1,11H2,2-4H3
charge 0 multiplicity 1
57 atoms
O  -0.407924 0.006923 2.66363
O  -1.383135 -3.852316 -1.097654
O  1.125038 -3.210971 -0.376672
O  2.548002 2.03509 0.34306
N  0.605201 -0.943748 -0.065773
N  -1.149819 -0.161333 1.446615
N  0.327463 1.296807 0.154776
N  4.867929 0.718212 0.401352
N  6.750103 -0.551905 0.430318
C  -1.709431 -0.012074 -0.912265
C  -0.471811 0.075168 0.138862
C  -1.606653 1.076795 -2.091338
C  -1.750935 -1.464238 -1.503128
C  -2.933569 0.154667 0.023725
C  -1.2195 -2.529985 -0.519529
C  -2.53322 0.076169 1.384279
C  0.276052 -2.266757 -0.281342
C  -0.264947 0.97141 -2.86817
C  -2.741174 0.853161 -3.149855
C  1.913632 -0.371285 0.105282
C  -1.856584 2.483653 -1.531649
C  1.696566 1.089744 0.221839
C  -4.310393 0.208403 -0.263522
C  -3.447786 0.112115 2.455863
C  -5.253661 0.264432 0.795475
C  3.095476 -1.089816 0.1194
C  -4.822087 0.225214 2.141635
C  -1.114906 3.601964 -1.741956
C  -0.374373 1.423077 3.17499
C  4.442947 -0.615923 0.256788
C  5.643352 -1.375374 0.279412
C  6.238928 0.710498 0.500584
H  -1.149242 -1.54245 -2.425598
H  -2.789616 -1.727663 -1.760759
H  -1.763526 -2.478614 0.443676
H  -0.099281 2.219568 0.040402
H  -0.25752 1.713303 -3.68661
H  0.621028 1.155041 -2.242992
H  -0.151369 -0.021013 -3.336647
H  -3.741546 1.094215 -2.758414
H  -2.748659 -0.181685 -3.532929
H  -2.557942 1.528672 -4.003985
H  -2.785245 2.574971 -0.947402
H  -4.67712 0.192434 -1.292973
H  -3.102403 0.016833 3.489413
H  -0.501846 -4.316765 -1.0004
H  -6.322193 0.322964 0.564924
H  2.997462 -2.175356 0.00985
H  -5.558777 0.256978 2.951774
H  -1.435088 4.572167 -1.344876
H  -0.183564 3.594634 -2.319665
H  -1.377933 1.880919 3.122099
H  0.363357 2.024014 2.619788
H  -0.064233 1.306135 4.225082
H  4.179526 1.503321 0.415674
H  5.745717 -2.456109 0.196086
H  6.836433 1.611009 0.619747
