program: Gaussian 09
title: 000156037
version: EM64L-G09RevD.01
frameworkgroup: C1[X(C17H21NO5)]
method: RPBEPBE
basis: SDD
operation: Freq
keyword: #p
keyword: freq=noraman
keyword: PBEPBE/SDD
title: #p freq=noraman PBEPBE/SDD
converged: YES YES NO NO
title: Mulliken charges:
elementType: O O O O O N C C C C C C C C C C C C C C C C C H H H H H H H H H H H H H H H H H H H H H
charge: -0.381531 -0.283816 -0.300550 -0.237992 -0.267018 -0.001940 -0.119495 -0.080753 -0.289834 -0.512676 -0.504015 -0.528759 0.025149 -0.587220 0.246601 0.181058 -0.514546 0.200363 -0.344842 -0.342855 -0.225874 -0.222571 -0.222878 0.308730 0.255177 0.264652 0.241373 0.248935 0.248514 0.248223 0.299523 0.241037 0.249649 0.262652 0.219155 0.259132 0.236419 0.247267 0.215003 0.265279 0.311171 0.230709 0.233257 0.230140
chargesum: 0.00000
title: Mulliken charges with hydrogens summed into heavy atoms:
elementType: O O O O O N C C C C C C C C C C C C C C C C C
charge: -0.381531 -0.283816 -0.300550 -0.237992 -0.267018 -0.001940 0.189236 0.174424 -0.025183 -0.022367 -0.007277 0.011801 0.274798 0.153718 0.246601 0.181058 0.184142 0.200363 -0.079563 -0.031684 0.004835 0.010686 0.007262
polarizability: 2.68902107e+02 1.30509584e+01 2.14851351e+02 3.95276754e+00 8.76117611e+00 1.33349241e+02
1716.lowfreq: -3.3748 -0.0004 0.0005 0.0006 2.5477 15.0240 28.9694 33.2524 38.5951
frequency: 28.7929 32.3870 38.5481 66.8339 70.0504 88.7076 116.2800 135.6356 142.1362 155.4165 164.8633 179.8314 191.5459 229.2686 231.4576 269.7552 281.5685 298.6988 307.4692 333.3716 351.8871 373.1561 397.1722 405.7864 427.4445 439.4577 451.1285 496.6641 519.8952 539.8940 549.7489 581.7675 613.0865 627.2436 655.9168 668.2846 680.3752 703.2576 704.9427 738.6346 793.4233 797.3415 804.4066 808.1078 837.5044 868.9173 869.5126 885.5186 912.5137 934.0882 960.1138 967.8368 977.9105 980.0150 989.3787 999.4632 1013.2032 1014.6446 1018.7681 1023.7467 1045.7013 1057.2462 1065.2752 1083.1197 1089.6749 1096.4237 1113.9579 1117.5429 1147.3567 1148.3892 1159.4019 1166.9208 1173.1916 1187.4211 1198.6340 1217.3998 1228.0483 1239.9387 1245.6482 1262.4893 1281.4471 1296.4382 1305.0379 1312.9815 1319.9049 1325.8733 1338.4219 1351.1456 1389.3737 1393.7817 1411.0322 1415.5123 1438.1111 1444.6651 1447.1379 1449.9956 1466.5678 1471.6854 1478.0641 1484.5931 1498.6002 1583.1597 1610.1000 1614.6742 1635.3551 2993.8760 2994.3031 3009.1677 3011.5137 3017.0369 3025.8293 3028.2719 3065.5492 3072.2349 3088.9871 3095.3125 3097.6869 3103.4658 3122.3483 3128.0252 3128.8833 3140.7652 3146.4415 3152.0624 3161.6839 3170.2774
redmass: 4.9922 5.3447 5.0665 5.2616 3.5328 4.3165 1.2462 5.1966 5.1006 3.3498 4.4539 6.0566 1.4421 4.4182 1.8599 3.3780 6.4863 2.9389 3.4006 6.1804 2.8389 4.2923 5.5963 2.8551 3.1436 4.7612 3.7761 5.3601 6.4055 4.5029 4.3112 4.5721 6.4425 3.7150 4.7080 5.7272 5.1541 5.0059 1.7269 3.8403 2.6717 2.3944 3.7697 2.0417 2.4956 1.6728 1.9486 2.9761 3.4058 3.4065 1.4139 4.0949 2.4572 5.1714 6.1226 1.3674 2.1564 1.3418 2.1518 2.4261 3.0434 2.1340 3.1110 2.2873 1.9369 2.3764 1.2954 1.4756 1.3599 1.3093 1.4150 1.6933 1.0623 1.1205 1.5796 1.1972 1.5981 1.5149 3.7334 1.8093 1.4410 1.6008 1.3956 1.5607 1.3109 1.4167 1.5362 1.4391 9.6276 1.2537 1.1633 1.1705 2.2454 1.0481 1.0918 1.0506 1.0478 1.0521 2.2564 1.0741 1.0884 6.8507 6.9140 8.2782 10.1515 1.0397 1.0713 1.0332 1.0826 1.0610 1.0606 1.0629 1.0976 1.0946 1.1028 1.1042 1.1031 1.0900 1.1008 1.0854 1.1044 1.0888 1.1037 1.0933 1.0968 1.1013
irintensity: 0.9404 2.9489 2.9250 0.5972 7.2918 1.5106 0.4718 2.5017 4.0253 2.1245 2.7579 2.2628 4.2362 9.0494 1.3240 5.6563 16.7892 3.1414 16.8508 28.7320 11.9406 2.9517 2.7711 0.0015 4.6253 46.0318 0.6008 14.6594 25.5725 3.1749 15.1010 6.3367 0.1262 4.5073 5.7121 3.6523 11.7481 14.3821 82.0201 8.7564 5.5106 18.9815 47.7681 14.1041 8.0297 0.9500 2.5556 5.7545 3.0943 4.4909 4.0832 26.4031 4.5722 8.1177 1.0563 0.5551 12.9983 0.5657 41.5264 57.8675 50.2747 10.9319 358.4208 89.6902 69.5133 125.2254 4.9804 18.5359 6.1200 1.0277 2.4841 22.1292 1.6102 34.3777 25.2208 2.5538 2.5159 34.8393 380.9136 7.2566 3.7814 6.0947 2.5927 6.1841 0.3329 5.4548 4.7818 11.6109 4.2113 5.0554 8.9565 18.1138 17.3777 13.1734 20.9249 13.0028 7.7624 8.8048 7.0656 4.4099 30.7311 42.8154 37.2079 99.8045 250.6610 58.0830 15.6006 30.5264 8.9367 18.5983 14.5800 41.7873 9.4401 10.6262 35.3023 25.7255 0.6631 15.2994 17.0251 0.9211 23.9425 13.8408 6.3580 11.6386 7.0526 34.2689
temp: 298.150 k
press: 1.00000 atm
elementType: 8 8 8 8 8 7 6 6 6 6 6 6 6 6 6 6 6 6 6 6 6 6 6 1 1 1 1 1 1 1 1 1 1 1 1 1 1 1 1 1 1 1 1 1
symmnumber: 1
zpe: 934917.1 jmol-1
zpe.correction: 0.356091 hartree
zpe.thermalcorrener: 0.377232 hartree
zpe.thermalcorrenthalpy: 0.378176 hartree
zpe.thermalcorrgfe: 0.305629 hartree
zpe.sumelectzpe: -1089.489774 hartree
zpe.sumelectthermal: -1089.468633 hartree
zpe.sumelectthermalent: -1089.467689 hartree
zpe.sumelectthermalfe: -1089.540236 hartree
dipole: -3.7088 -2.5347 -1.8047
dipole: 4.8411
quadrupole: -102.1547 -130.9486 -137.5687
quadrupole: 13.7750 3.9652 -3.7291
quadrupole: 21.4026 -7.3912 -14.0114 13.7750 3.9652 -3.7291
hfenergy: -1089.8458647 hartree
pointgroup: C01 [X(C17H21N1O5)]
dipole: 1.5274583 0.825642 -0.7828577 debye
polarizability: 270.4429174|9.1131849|210.9105606|-4.2282315|-16.1947998|135.7492213 unknown
InChI: InChI=1S/C17H21NO5/c1-18(21)12-8-9-13(18)15(17(20)22-2)14(10-12)23-16(19)11-6-4-3-5-7-11/h3-7,12-15H,8-10H2,1-2H3
charge 0 multiplicity 1
44 atoms
O  2.773792 -0.880206 1.387217
O  -0.88232 0.226103 -0.253944
O  2.173431 -2.71316 -0.668712
O  0.332294 -2.144417 0.663878
O  -1.649153 2.397706 -0.655103
N  3.253578 0.179824 0.578011
C  2.862994 -0.007466 -0.927398
C  2.539275 1.550204 0.868863
C  1.383273 -0.469731 -0.897203
C  3.105592 1.392268 -1.543183
C  2.91408 2.415238 -0.361859
C  1.034486 1.233173 0.981176
C  0.515688 0.693313 -0.368603
C  4.754346 0.27985 0.756536
C  1.254305 -1.788909 -0.101689
C  -1.885552 1.1904 -0.386595
C  2.239954 -4.006142 0.036964
C  -3.230935 0.587646 -0.173056
C  -4.376811 1.394021 -0.395889
C  -3.374453 -0.759833 0.25393
C  -5.664368 0.854085 -0.201194
C  -4.666653 -1.291323 0.45022
C  -5.810811 -0.489517 0.221476
H  3.491934 -0.810268 -1.338593
H  2.933936 1.928626 1.826017
H  1.082304 -0.705083 -1.93718
H  2.401838 1.586436 -2.36988
H  4.122793 1.459955 -1.965842
H  3.838399 2.990754 -0.182288
H  2.115494 3.144834 -0.577005
H  0.894476 0.466118 1.761014
H  0.487552 2.151915 1.256652
H  0.510642 1.512853 -1.113868
H  5.175548 -0.692307 0.462052
H  5.192066 1.095269 0.156282
H  4.936955 0.444442 1.82868
H  1.249074 -4.491213 0.058166
H  2.587808 -3.839528 1.071316
H  2.963234 -4.610818 -0.530797
H  -4.236667 2.431442 -0.717918
H  -2.477435 -1.362058 0.431062
H  -6.550368 1.473985 -0.376414
H  -4.782216 -2.32827 0.783593
H  -6.812097 -0.908211 0.374708
