program: Gaussian 09
title: 000156030
version: EM64L-G09RevD.01
frameworkgroup: C1[X(C22H28O7)]
method: RPBEPBE
basis: SDD
operation: Freq
keyword: #pfreq=noraman
keyword: PBEPBE/SDD
title: #p freq=noraman PBEPBE/SDD
converged: YES YES NO NO
title: Mulliken charges:
elementType: O O O O O O O C C C C C C C C C C C C C C C C C C C C C C H H H H H H H H H H H H H H H H H H H H H H H H H H H H
charge: -0.323040 -0.446526 -0.209923 -0.245841 -0.225118 -0.197293 -0.270517 0.295408 -0.195070 0.355027 0.211953 -0.095640 -0.122661 -0.473479 -0.548773 -0.474259 -0.529292 -0.432079 -0.483307 -0.625199 0.126941 -0.174586 -0.755195 0.471163 0.308270 -0.395174 -0.362460 -0.763025 -0.174238 0.209680 0.146880 0.214289 0.232625 0.213742 0.213733 0.285730 0.230795 0.217972 0.255162 0.223388 0.200097 0.222233 0.296294 0.243268 0.260471 0.246232 0.224050 0.207368 0.225474 0.250096 0.373544 0.264911 0.277812 0.261342 0.250895 0.240045 0.265805
chargesum: 0.00000
title: Mulliken charges with hydrogens summed into heavy atoms:
elementType: O O O O O O O C C C C C C C C C C C C C C C C C C C C C C
charge: -0.323040 -0.072983 -0.209923 -0.245841 -0.225118 -0.197293 -0.270517 0.295408 0.014610 0.355027 0.211953 0.051239 0.091629 -0.027112 -0.049311 -0.025493 -0.050742 -0.009749 0.056255 -0.118496 0.126941 0.049463 -0.072257 0.471163 0.308270 -0.130263 -0.084648 -0.010743 0.091566
polarizability: 3.13480330e+02 -4.26504865e+00 2.31578606e+02 -4.48808222e+00 5.51324476e+00 1.91433037e+02
1716.lowfreq: -3.8932 -0.0002 0.0004 0.0006 6.3870 9.4364 23.1791 29.5610 42.6669
frequency: 23.1075 29.4735 42.6161 45.3622 55.6685 67.1160 82.2477 93.8908 101.1465 105.1422 137.1406 146.6707 166.0305 168.2841 172.6294 178.6519 201.6732 206.8612 227.3243 232.5606 245.9402 267.6678 279.4236 302.3171 309.2687 326.2547 338.0005 343.3133 364.1287 384.6295 400.5711 415.2521 443.2483 444.6659 462.7023 480.7488 507.3755 515.4370 537.9015 542.1712 556.5608 565.5376 576.4114 588.6767 608.9471 623.5438 639.4573 666.5333 682.4224 691.4137 723.1375 730.0359 740.7931 758.6306 784.7444 785.5752 807.7780 836.8304 849.7691 865.4232 866.7931 876.7337 885.6292 891.0579 898.4369 910.2051 931.5954 938.5556 948.8526 964.6258 969.1169 976.8555 987.4549 1001.3916 1004.4832 1010.9946 1013.7039 1042.1532 1043.9873 1049.5545 1054.2632 1061.1672 1064.3624 1072.9914 1082.3475 1083.8185 1103.8661 1112.8076 1125.6360 1137.8831 1139.8602 1148.5656 1160.6226 1176.7874 1197.1976 1200.1055 1202.2045 1210.1398 1217.8011 1239.9208 1244.0795 1259.8950 1273.4716 1274.9245 1281.3992 1281.9698 1297.3254 1308.3506 1326.9524 1328.4999 1337.0507 1343.1925 1345.2714 1345.7109 1352.4932 1359.0876 1361.1120 1375.3858 1385.3847 1395.0689 1401.4707 1421.0832 1454.2892 1454.8521 1462.3424 1466.3257 1467.6312 1477.4110 1480.4218 1482.9344 1484.0086 1491.7367 1494.2401 1506.6165 1586.5386 1640.4342 1671.1739 2871.0940 2919.7014 2938.6614 2970.6329 2981.9118 2993.1126 3006.4178 3008.0820 3012.0146 3024.0009 3026.9513 3043.1841 3050.7232 3055.4004 3069.0343 3070.7756 3070.9644 3072.2823 3082.2608 3083.9153 3097.1131 3138.5078 3143.1328 3174.6437 3225.7170 3252.2024 3272.7345 3419.0162
redmass: 6.0403 4.9522 5.3684 4.8273 4.3779 3.7611 5.2791 3.2877 1.8402 2.4810 4.3907 5.4100 3.4338 4.9910 4.0882 4.3402 3.8909 1.4256 2.9224 3.9649 5.1295 3.0876 3.0639 4.2326 3.4322 2.9310 6.5358 2.7186 3.5756 3.5476 4.2841 3.6297 3.0584 2.9710 3.5150 3.0856 2.5606 3.4867 2.6953 2.4126 1.5175 2.6150 3.3432 3.8233 4.1028 4.5084 3.2209 3.2310 2.8324 4.9831 4.4434 1.3745 4.9635 3.5615 3.9917 1.5784 3.0353 2.6078 5.9922 2.6268 1.4579 3.1377 1.8165 1.9426 3.0840 2.2249 1.8186 2.5906 1.8629 3.3193 2.7851 2.4636 3.5367 3.2809 2.1533 2.6080 2.4885 2.6321 1.7140 1.7590 2.4288 2.0946 1.9949 2.5391 3.1817 2.3047 2.5630 1.9834 3.0441 1.7153 1.5397 2.3383 1.9308 2.8465 1.6819 1.9043 1.4501 1.9407 1.3030 1.8427 1.4220 1.5821 1.3380 1.2187 1.1853 1.2852 1.3845 1.3225 1.4126 1.2526 1.5005 1.6357 1.4002 1.6588 1.4011 1.6634 1.7489 1.2366 1.2917 1.2173 2.5065 1.4760 1.0500 1.0643 1.0867 1.0832 1.0852 1.0728 1.0676 1.1728 3.6551 1.0941 1.1248 1.0894 6.0715 8.6005 11.6156 1.0810 1.0818 1.0829 1.0651 1.0360 1.0607 1.0373 1.0614 1.0617 1.0623 1.0842 1.0945 1.0998 1.0652 1.1002 1.0895 1.0959 1.0683 1.1010 1.1016 1.0965 1.1020 1.1015 1.1159 1.0933 1.0992 1.1079 1.0658
irintensity: 0.4931 0.4543 0.2478 0.6148 1.1597 2.0883 0.4011 3.4703 0.1589 1.1806 1.8983 4.7994 0.5269 0.3993 2.9293 3.4617 2.8283 1.8963 3.4634 5.1986 1.4444 4.3857 1.4811 3.1957 16.1016 0.6897 2.3751 5.2074 5.6390 1.9896 5.1369 0.3276 3.6619 4.8925 2.5807 2.1734 19.0767 17.5414 23.6209 17.8195 83.3397 29.1937 4.1136 14.4201 13.0473 1.5210 14.5101 7.1736 1.4645 6.6965 10.5632 18.8961 1.2759 10.0162 7.7849 77.6727 21.6130 3.4105 29.4014 44.0801 7.0208 14.4229 8.4758 1.1503 74.2085 2.9578 19.0179 15.1026 20.7646 20.1015 3.0847 20.9386 26.5457 48.7140 123.9786 7.0743 29.5401 86.8209 18.1508 11.4733 54.5512 11.4628 30.3991 3.0778 110.2643 7.9347 14.9987 39.6920 9.4295 11.3819 25.4381 17.3867 11.9850 2.0849 73.3464 117.4374 1.8977 83.9245 6.3019 70.4354 21.0779 6.4128 2.3928 0.6194 11.5014 1.4594 4.2535 11.5110 5.6291 34.3369 0.2383 5.2358 3.8075 3.0078 40.8022 3.1881 3.3826 2.8263 78.2868 19.9824 4.4486 37.1284 18.9670 31.1874 16.2816 9.0674 6.5797 6.6158 8.8882 15.0694 26.1196 20.0687 28.6750 9.7990 7.4911 153.2612 219.1767 61.2673 16.6596 33.0178 35.1722 29.5706 27.4104 2.5829 18.2770 19.6835 14.8772 16.5758 45.2484 46.3931 1.9958 9.4442 2.9550 44.2034 37.4799 19.7787 28.9110 6.0333 7.1056 11.4636 15.7988 0.5837 0.5956 0.1010 90.1641
temp: 298.150 k
press: 1.00000 atm
elementType: 8 8 8 8 8 8 8 6 6 6 6 6 6 6 6 6 6 6 6 6 6 6 6 6 6 6 6 6 6 1 1 1 1 1 1 1 1 1 1 1 1 1 1 1 1 1 1 1 1 1 1 1 1 1 1 1 1
symmnumber: 1
zpe: 1223036.2 jmol-1
zpe.correction: 0.465830 hartree
zpe.thermalcorrener: 0.493041 hartree
zpe.thermalcorrenthalpy: 0.493985 hartree
zpe.thermalcorrgfe: 0.408582 hartree
zpe.sumelectzpe: -1379.444831 hartree
zpe.sumelectthermal: -1379.417620 hartree
zpe.sumelectthermalent: -1379.416676 hartree
zpe.sumelectthermalfe: -1379.502080 hartree
dipole: 2.9835 -1.1796 -6.1272
dipole: 6.9163
quadrupole: -172.9798 -172.6204 -177.4272
quadrupole: 9.0671 -2.6461 7.6954
quadrupole: 1.3627 1.7221 -3.0847 9.0671 -2.6461 7.6954
hfenergy: -1379.9106614 hartree
pointgroup: C01 [X(C22H28O7)]
dipole: 1.2045398 -2.1698957 -1.1157572 debye
polarizability: 313.7089258|-4.2594351|211.3890864|-0.4110897|-20.7360601|211.3939606 unknown
InChI: InChI=1S/C22H28O7/c1-13-8-18(24)22(12-27-14(2)23)17(4-3-6-20(22)11-28-20)21(13)9-16(29-19(21)25)15-5-7-26-10-15/h5,7,10,13,16-18,24H,3-4,6,8-9,11-12H2,1-2H3
charge 0 multiplicity 1
57 atoms
O  -4.128885 -1.30173 -0.842263
O  -3.087303 0.900422 -2.305205
O  2.398971 0.873148 1.141367
O  -3.583299 1.115739 0.519112
O  0.554352 2.176728 0.719245
O  6.749945 -0.548225 0.774345
O  -3.833266 0.487902 2.75961
C  -1.753091 -0.263167 -0.491847
C  -0.293708 -0.857571 -0.278295
C  -2.709535 -1.476358 -0.29971
C  0.929404 0.085056 -0.638587
C  -1.805291 0.301769 -1.949763
C  0.70103 0.772148 -2.041658
C  -0.148494 -1.552316 1.103951
C  -2.633638 -2.158666 1.061163
C  -3.184799 -2.309534 -1.458377
C  -0.721086 1.354302 -2.19771
C  -1.193678 -2.676872 1.292808
C  -2.119438 0.836655 0.549992
C  2.252034 -0.746295 -0.655581
C  1.207318 1.152081 0.448705
C  3.018994 -0.41381 0.657422
C  1.753016 1.854185 -2.382096
C  4.499045 -0.230746 0.520656
C  -4.326518 0.902706 1.683411
C  5.201877 0.73777 -0.307239
C  5.472411 -0.980782 1.159042
C  -5.781406 1.221679 1.430101
C  6.552466 0.518488 -0.125311
H  -0.224773 -1.665351 -1.044456
H  -1.590796 -0.556141 -2.634117
H  0.80494 -0.053798 -2.781049
H  -0.238553 -0.813717 1.923666
H  0.859028 -1.997965 1.193435
H  -3.359549 -2.991443 1.094898
H  -2.912402 -1.454738 1.864838
H  -2.89611 -2.081789 -2.490077
H  -3.457451 -3.35553 -1.268371
H  -0.862697 2.222056 -1.529833
H  -0.849501 1.727578 -3.230887
H  -0.974792 -3.499521 0.58098
H  -1.110424 -3.1004 2.310742
H  -1.63066 1.789591 0.314419
H  -1.849641 0.548661 1.579415
H  2.872077 -0.461443 -1.521175
H  2.062882 -1.830439 -0.733264
H  2.81152 -1.160283 1.445314
H  2.790066 1.473384 -2.342489
H  1.582267 2.228324 -3.407534
H  1.672154 2.715413 -1.694778
H  -3.804125 0.400865 -1.820713
H  4.755125 1.516481 -0.92234
H  5.446763 -1.803559 1.868217
H  -6.192771 0.484567 0.717085
H  -5.883536 2.218392 0.969758
H  -6.344056 1.177805 2.373598
H  7.457384 0.982391 -0.50597
