program: Gaussian 09
title: 000156003
version: EM64L-G09RevD.01
frameworkgroup: C1[X(C16H12ClNO4S)]
method: RPBEPBE
basis: SDD
operation: Freq
keyword: #p
keyword: freq=noraman
keyword: PBEPBE/SDD
title: #p freq=noraman PBEPBE/SDD
converged: YES YES NO NO
title: Mulliken charges:
elementType: Cl S O O O O N C C C C C C C C C C C C C C C C H H H H H H H H H H H H
charge: -0.052452 0.281391 -0.266167 -0.236849 -0.422681 -0.192421 -0.072302 -0.067984 -0.336314 0.412120 0.376039 0.358250 -0.175173 -0.362235 -0.344309 -0.391828 -0.314924 -0.260621 -0.321203 -0.712574 -0.114217 -0.197351 0.170897 0.245703 0.259886 0.263446 0.265368 0.314119 0.272104 0.259102 0.251661 0.244753 0.223386 0.259171 0.384209
chargesum: 0.00000
title: Mulliken charges with hydrogens summed into heavy atoms:
elementType: Cl S O O O O N C C C C C C C C C C C C C C C C
charge: -0.052452 0.281391 -0.266167 -0.236849 -0.038472 -0.192421 -0.072302 0.177719 -0.336314 0.412120 0.376039 0.358250 -0.175173 -0.102350 -0.080863 -0.126459 -0.000805 0.011483 -0.062100 0.007227 -0.114217 0.061820 0.170897
polarizability: 3.89668916e+02 2.67205285e+01 2.25923626e+02 -7.96488481e+00 1.44158521e+01 1.05733906e+02
1716.lowfreq: -9.1610 -5.1650 -1.3853 -0.0017 -0.0014 0.0003 16.8828 19.6507 24.8821
frequency: 16.8207 19.5206 24.8783 38.2661 46.8596 62.7785 81.3915 109.1898 145.8924 167.9750 186.1227 191.1681 205.7732 221.1580 241.7299 246.9500 268.3140 311.6279 342.6736 356.5826 373.9805 386.4145 396.5072 421.1066 429.5894 486.9993 503.2440 513.1249 527.8879 537.2261 565.3627 575.4774 603.6921 614.7661 635.4494 641.7294 707.0988 714.4932 716.3969 721.9677 722.7399 737.3237 777.4958 806.6744 818.2176 820.8214 837.5588 858.8185 873.1996 922.1997 949.9206 954.0852 969.1565 999.6563 1020.0973 1032.4411 1033.1838 1068.5317 1085.8697 1108.5313 1113.1567 1127.5596 1136.5956 1169.3697 1182.0625 1217.1983 1234.7338 1238.7912 1272.6331 1298.8786 1317.5796 1343.8599 1360.9376 1382.2830 1390.9618 1396.4773 1422.1474 1437.2188 1462.2539 1474.2010 1483.0685 1522.1913 1559.1014 1595.7732 1601.6556 1614.1683 1682.8033 3004.6277 3019.1517 3107.7502 3118.8939 3158.1299 3163.1013 3163.4454 3176.2887 3182.6531 3182.8686 3194.2181 3509.0626
redmass: 7.4755 7.3691 9.9830 8.5146 5.6913 4.8510 8.5493 5.7385 7.8471 7.3250 5.9491 5.3600 7.5023 1.1504 5.7437 5.1208 4.9759 5.0508 9.0455 7.6855 8.0351 7.1542 6.7400 3.1379 3.2328 4.4333 8.0642 2.6883 8.3906 8.2079 6.1324 4.7429 3.3874 1.7978 4.2445 7.8752 3.7671 5.5201 6.4835 4.4672 6.2636 6.5106 3.0912 5.4963 1.3772 1.3195 1.5954 1.3780 8.0894 3.1339 1.3497 1.3341 1.3184 2.9845 2.6166 2.4475 2.7890 3.3398 1.9054 3.0051 1.3807 1.4644 2.2076 2.9717 1.4771 3.6667 1.7624 1.6016 2.3920 1.3020 1.2747 1.6018 4.0857 6.6451 1.2457 4.6375 3.6323 3.4064 1.0464 1.0536 2.3675 11.6909 7.4967 8.0869 7.9938 6.3858 8.8812 1.0349 1.0855 1.1000 1.1016 1.0903 1.0885 1.0887 1.0935 1.0977 1.0977 1.0948 1.0641
irintensity: 0.3705 0.3548 1.5961 0.3830 0.2685 0.2456 0.0509 0.1833 2.3180 1.0066 2.3699 0.6226 1.0681 0.2870 2.0645 1.5747 0.2512 2.7412 4.5298 0.2942 0.3233 0.3649 4.1785 0.0766 11.9934 10.3878 0.0350 20.6141 51.7263 4.4007 19.0215 3.0120 39.1849 101.7351 22.1334 1.3648 20.8843 29.7542 30.6676 3.0978 61.3801 4.6441 1.5039 0.7243 28.2473 10.6627 105.9906 22.8521 20.8408 45.7838 0.3103 1.2525 2.6717 29.4834 260.4000 31.9288 16.5309 7.0046 60.2644 111.4992 27.0529 1.1830 0.8674 670.8557 328.9988 25.3335 25.3402 2.5000 28.6489 2.9431 0.8443 18.4717 7.3470 0.5537 28.3963 11.5094 2.9836 122.3458 13.6344 13.0398 436.4373 676.9316 1.4064 8.2768 122.0571 22.2913 175.6978 14.0829 15.0840 15.6496 12.6356 5.6031 3.2076 1.6940 0.1275 1.6932 3.2234 12.7437 25.6267
temp: 298.150 k
press: 1.00000 atm
elementType: 17 16 8 8 8 8 7 6 6 6 6 6 6 6 6 6 6 6 6 6 6 6 6 1 1 1 1 1 1 1 1 1 1 1 1
symmnumber: 1
zpe: 644623.1 jmol-1
zpe.correction: 0.245524 hartree
zpe.thermalcorrener: 0.266485 hartree
zpe.thermalcorrenthalpy: 0.267429 hartree
zpe.thermalcorrgfe: 0.191854 hartree
zpe.sumelectzpe: -1829.028286 hartree
zpe.sumelectthermal: -1829.007325 hartree
zpe.sumelectthermalent: -1829.006381 hartree
zpe.sumelectthermalfe: -1829.081957 hartree
dipole: 2.4894 -2.0725 -1.5254
dipole: 3.5804
quadrupole: -147.5040 -130.2890 -153.7215
quadrupole: -11.5158 -10.9092 -0.1671
quadrupole: -3.6658 13.5492 -9.8834 -11.5158 -10.9092 -0.1671
hfenergy: -1829.2738101 hartree
pointgroup: C01 [X(C16H12Cl1N1O4S1)]
dipole: -0.9503046 1.0187518 -0.2081463 debye
polarizability: 385.0624012|13.2123927|209.3596196|42.1943695|44.240211|126.9044276 unknown
InChI: InChI=1S/C16H12ClNO4S/c1-9(15(19)20)21-11-3-5-12(6-4-11)22-16-18-13-7-2-10(17)8-14(13)23-16/h2-9,19H,1H3
charge 0 multiplicity 1
35 atoms
Cl 7.933186 1.103832 1.186463
S  3.545323 -2.050728 -0.562703
O  -4.545071 -0.219378 -1.099195
O  0.87096 -1.747655 -0.82372
O  -4.546745 2.503333 1.219987
O  -5.347534 0.367998 1.696036
N  2.089056 0.159962 0.038864
C  -5.045319 1.092575 -0.671222
C  4.380676 -0.57642 0.088634
C  3.432036 0.471375 0.337304
C  -3.166055 -0.485024 -0.968084
C  -0.467034 -1.22602 -0.835545
C  1.976657 -1.06536 -0.422217
C  -2.768299 -1.777289 -1.39289
C  -2.206896 0.430866 -0.47552
C  -1.41694 -2.149752 -1.326152
C  -0.842488 0.061414 -0.406536
C  5.754852 -0.409953 0.338963
C  3.883058 1.709501 0.847986
C  -6.498827 1.170277 -1.157279
C  6.161035 0.83985 0.847245
C  5.256566 1.895517 1.104632
C  -4.999476 1.222562 0.862012
H  -4.436338 1.902503 -1.114823
H  -3.52872 -2.468718 -1.765904
H  -2.489762 1.431382 -0.135231
H  -1.085312 -3.14134 -1.646176
H  -0.090792 0.756649 -0.030218
H  6.483776 -1.202311 0.15297
H  3.162493 2.509665 1.038137
H  -7.088879 0.351659 -0.713312
H  -6.523637 1.074811 -2.255255
H  -6.949806 2.137112 -0.873643
H  5.624843 2.846106 1.499575
H  -4.575085 2.605799 2.210517
