program: Gaussian 09
title: 000155998
version: EM64L-G09RevD.01
frameworkgroup: C1[X(C13H28O5)]
method: RPBEPBE
basis: SDD
operation: Freq
keyword: #pfreq=noraman
keyword: PBEPBE/SDD
title: #p freq=noraman PBEPBE/SDD
converged: YES YES NO NO
title: Mulliken charges:
elementType: O O O O O C C C C C C C C C C C C C H H H H H H H H H H H H H H H H H H H H H H H H H H H H
charge: -0.304899 -0.273116 -0.337499 -0.273175 -0.493865 0.344997 0.013712 -0.689224 -0.705465 -0.740784 -0.286080 -0.727602 -0.260807 -0.234572 -0.198699 -0.314332 -0.283012 -0.302968 0.180182 0.223424 0.195571 0.228704 0.231074 0.219683 0.190311 0.224075 0.217908 0.222055 0.203945 0.200674 0.237854 0.185299 0.275292 0.198213 0.196240 0.216623 0.189114 0.217129 0.184149 0.217095 0.207813 0.206193 0.196240 0.198116 0.192920 0.411495
chargesum: 0.00000
title: Mulliken charges with hydrogens summed into heavy atoms:
elementType: O O O O O C C C C C C C C C C C C C
charge: -0.304899 -0.273116 -0.337499 -0.273175 -0.082370 0.344997 0.193894 -0.041525 -0.064397 -0.076746 0.118539 -0.029158 0.133646 0.171164 0.202579 0.110577 0.119422 0.088068
polarizability: 1.88910694e+02 1.06136011e+00 1.57693370e+02 -6.27672085e-01 3.59885116e+00 1.45084932e+02
1716.lowfreq: -13.7713 -6.9821 -5.3201 0.0002 0.0003 0.0005 15.4085 21.7053 34.5346
frequency: 15.2486 21.3941 34.4327 40.0722 53.0218 63.0694 80.4015 86.8895 105.1930 117.2418 160.7536 163.7862 176.3264 190.9103 194.8469 230.6427 240.5683 252.6162 256.3521 256.7445 290.7878 298.6009 309.9186 324.6009 332.6359 337.9404 365.5004 382.9192 421.2606 439.5828 475.3698 494.2085 506.1206 524.3090 598.5580 710.2691 742.3780 785.3421 790.9922 834.4077 851.5165 855.6787 871.7816 890.8588 900.1920 910.1350 925.0471 938.0978 941.2071 956.0564 976.7387 990.3392 1017.1231 1023.5736 1032.8054 1037.6044 1050.7898 1062.0795 1076.6980 1082.4965 1092.5969 1099.6841 1116.7860 1122.1814 1154.0447 1184.5095 1194.8190 1201.1612 1219.5352 1237.7411 1240.6175 1246.8741 1254.9003 1265.2874 1268.2445 1322.1768 1335.2857 1336.7048 1348.0745 1352.5391 1360.3171 1370.8419 1371.5599 1376.0113 1385.4549 1391.3055 1396.5979 1407.0511 1409.4283 1438.4978 1444.4859 1445.9800 1447.9646 1451.6873 1452.9514 1462.8635 1463.7295 1467.3524 1471.8274 1472.4272 1473.8085 1481.2786 1488.2370 1495.9570 2924.7006 2934.0086 2938.2284 2951.7316 2953.2127 2958.1627 2963.4412 2970.5208 2977.9814 2979.9670 2982.8134 2987.0917 2988.9179 3001.3276 3005.4460 3014.7389 3037.6981 3039.4173 3052.0807 3074.0914 3076.7601 3077.5707 3080.1914 3089.8359 3094.8231 3102.6186 3107.7981 3211.4628
redmass: 3.2978 4.2070 3.6475 3.8653 4.2322 4.1074 4.1010 3.6523 3.2343 4.0531 3.6157 2.7011 1.1159 2.8694 3.6007 2.4081 1.1064 1.6383 1.4331 1.2839 2.4289 2.2666 2.7410 3.0434 2.4130 2.5575 2.4573 2.4866 2.3233 2.6871 2.1831 2.7966 2.3908 2.8116 3.1074 3.5181 3.2075 2.9486 2.1730 2.3835 1.3125 2.3126 2.4940 2.1679 1.6423 1.6532 1.9116 1.5996 1.3533 2.9399 2.0589 2.1918 1.4371 1.3916 3.3473 3.1262 2.2937 3.5404 2.1895 2.7732 3.2437 2.0820 2.5335 2.3859 2.1269 2.0756 1.0773 1.1243 1.1505 2.0518 1.3448 1.1583 3.0038 1.1409 1.1175 1.2604 1.2292 1.5291 1.2547 1.2463 1.2425 1.2311 1.2353 1.2636 1.2951 1.2898 1.2281 1.3122 1.2759 1.0832 1.0890 1.0671 1.0687 1.0844 1.0846 1.0506 1.0493 1.0598 1.0854 1.0663 1.0645 1.0554 1.0538 1.0549 1.0557 1.0622 1.0574 1.0664 1.0663 1.0645 1.0587 1.0595 1.0355 1.1024 1.0357 1.0365 1.0363 1.1065 1.1034 1.1064 1.1046 1.1013 1.1016 1.0988 1.0998 1.0999 1.0987 1.0991 1.0998 1.0993 1.0996 1.0690
irintensity: 1.0344 0.8642 0.5201 1.1810 0.5823 3.0738 16.2848 1.2414 1.8550 5.8824 9.6154 1.8568 0.4882 4.3315 3.5290 3.8117 1.2493 0.6785 0.2800 0.3739 1.5760 2.4506 1.1561 2.1035 1.4850 1.5058 2.6406 1.5456 0.9855 3.8688 21.2342 2.5498 1.2186 4.1743 1.7990 3.9581 2.4053 0.9882 12.0261 25.0507 45.0173 26.9865 14.8669 11.1782 0.7439 2.1283 54.0343 17.8306 4.5219 107.8405 19.3593 60.9336 1.5068 0.0501 12.6838 27.5988 42.1387 160.3311 20.2095 94.1520 60.1973 58.3490 17.7369 34.3919 25.9314 118.8115 4.9844 17.5667 1.2040 24.9650 15.1002 4.3606 24.5270 24.5277 4.2602 14.4682 17.9865 3.8896 12.2356 10.3252 6.8398 24.7120 33.4851 2.7379 22.3165 8.8937 29.8998 19.5109 21.9329 9.6282 1.7085 4.5345 4.9759 17.9240 4.9663 0.5791 6.2610 2.4907 2.1744 14.9076 0.9399 11.1813 28.7464 5.9133 29.8674 17.7225 38.1841 121.4552 52.4683 80.3189 41.6014 82.5107 26.7912 90.4340 19.3027 16.2341 37.8377 39.3412 55.8469 44.4183 57.8451 58.4950 62.3111 9.7524 42.1336 15.2849 10.7278 80.0270 34.9935 25.2644 35.7475 421.2013
temp: 298.150 k
press: 1.00000 atm
elementType: 8 8 8 8 8 6 6 6 6 6 6 6 6 6 6 6 6 6 1 1 1 1 1 1 1 1 1 1 1 1 1 1 1 1 1 1 1 1 1 1 1 1 1 1 1 1
symmnumber: 1
zpe: 1050889.8 jmol-1
zpe.correction: 0.400263 hartree
zpe.thermalcorrener: 0.423128 hartree
zpe.thermalcorrenthalpy: 0.424072 hartree
zpe.thermalcorrgfe: 0.345906 hartree
zpe.sumelectzpe: -886.705487 hartree
zpe.sumelectthermal: -886.682622 hartree
zpe.sumelectthermalent: -886.681677 hartree
zpe.sumelectthermalfe: -886.759844 hartree
dipole: -0.6873 1.0218 0.0863
dipole: 1.2345
quadrupole: -111.9807 -103.8475 -105.0546
quadrupole: -8.3262 -2.9421 0.4637
quadrupole: -5.0198 3.1134 1.9064 -8.3262 -2.9421 0.4637
hfenergy: -887.1057498 hartree
pointgroup: C01 [X(C13H28O5)]
dipole: 0.2280352 0.4099844 -0.1256818 debye
polarizability: 188.6759368|1.2704802|155.9430503|-2.8273908|-5.8044374|147.0700086 unknown
InChI: InChI=1S/C13H28O5/c1-12(18-13(2,3)4)11-17-10-9-16-8-7-15-6-5-14/h12,14H,5-11H2,1-4H3
charge 0 multiplicity 1
46 atoms
O  -3.135651 0.113027 0.265278
O  -0.361249 1.248901 0.157655
O  2.416232 1.340096 -0.603737
O  4.892005 -0.355302 -0.696051
O  2.099878 -1.004233 0.66567
C  -4.360037 -0.680217 -0.066353
C  -1.908986 -0.567745 0.733524
C  -4.311728 -1.142004 -1.544583
C  -5.487741 0.357871 0.120692
C  -4.566289 -1.876213 0.891624
C  -1.011434 0.55139 1.275625
C  -1.186548 -1.421557 -0.328276
C  0.55801 2.292371 0.596841
C  1.553721 2.524725 -0.532315
C  3.398213 1.349704 -1.691878
C  4.000776 -0.049788 -1.822579
C  4.503404 -1.500442 0.147718
C  3.445318 -1.163028 1.212161
H  -2.16198 -1.206732 1.608723
H  -3.537492 -1.908977 -1.711313
H  -5.287828 -1.566043 -1.848096
H  -4.087131 -0.277641 -2.193545
H  -5.281436 1.246773 -0.500412
H  -5.540409 0.681569 1.17483
H  -6.465949 -0.063478 -0.175074
H  -4.563638 -1.541365 1.94502
H  -5.544638 -2.347844 0.686296
H  -3.789861 -2.652392 0.765787
H  -1.631871 1.258418 1.865547
H  -0.226169 0.103291 1.922689
H  -1.069977 -0.843349 -1.259383
H  -1.74226 -2.350724 -0.544999
H  -0.177709 -1.69026 0.035954
H  0.011227 3.236053 0.817173
H  1.10721 1.983071 1.513502
H  1.012177 2.654937 -1.492403
H  2.167644 3.428459 -0.331026
H  4.195137 2.090104 -1.47249
H  2.898721 1.625692 -2.64725
H  3.190159 -0.800031 -1.908881
H  4.61401 -0.076588 -2.746125
H  5.445037 -1.804586 0.642026
H  4.139768 -2.340234 -0.481645
H  3.386423 -2.006442 1.926525
H  3.76931 -0.255463 1.765286
H  2.054433 -0.127075 0.168067
