program: Gaussian 09
title: 000155969
version: EM64L-G09RevD.01
frameworkgroup: C1[X(C14H19N3O2)]
method: RPBEPBE
basis: SDD
operation: Freq
keyword: #p
keyword: freq=noraman
keyword: PBEPBE/SDD
title: #p freq=noraman PBEPBE/SDD
converged: YES YES NO NO
title: Mulliken charges:
elementType: O O N N N C C C C C C C C C C C C C C H H H H H H H H H H H H H H H H H H H
charge: -0.186664 -0.209058 -0.193525 -0.070166 -0.029382 -0.028939 0.113206 -0.395324 -0.383340 -0.021882 0.227728 -0.237601 0.208968 -0.706909 -0.717911 0.432501 -0.597626 -0.808861 -0.841532 0.231191 0.205375 0.222918 0.211461 0.249791 0.272063 0.223823 0.220126 0.223182 0.238764 0.214188 0.228122 0.261467 0.246902 0.228809 0.257173 0.240966 0.235333 0.234665
chargesum: 0.00000
title: Mulliken charges with hydrogens summed into heavy atoms:
elementType: O O N N N C C C C C C C C C C C C C C
charge: -0.186664 -0.209058 -0.193525 -0.070166 -0.029382 0.202252 0.113206 0.032969 0.077911 -0.021882 0.227728 0.034462 0.208968 -0.039779 -0.036837 0.432501 -0.336159 -0.075977 -0.130569
polarizability: 2.49604377e+02 1.74766859e+00 1.94903903e+02 -5.58879735e+00 2.82415165e-01 1.18734453e+02
1716.lowfreq: -13.5634 -8.4781 0.0004 0.0007 0.0007 3.5100 26.7901 47.6887 55.1396
frequency: 26.7173 47.5722 54.9627 63.4110 77.0972 87.8787 104.4639 129.6150 142.9626 163.4884 194.4813 197.5270 216.4794 226.6876 255.6562 261.0123 279.9748 298.0629 328.5334 342.5573 354.9474 389.3837 402.4911 428.1959 458.3188 489.9126 524.2021 552.1908 615.6327 631.9417 653.7111 674.5052 698.1790 710.7748 761.8442 764.3839 781.9662 798.9617 831.6762 847.7649 861.0775 905.8883 914.4414 948.7074 1002.0392 1003.3692 1018.0497 1024.7931 1028.0473 1049.0653 1053.6065 1056.8372 1079.3692 1110.1015 1137.5362 1160.4001 1184.2117 1189.8902 1213.6223 1227.2456 1247.8578 1279.0988 1289.7818 1306.0873 1312.0856 1329.7913 1347.4326 1351.7728 1382.3857 1386.5186 1391.7750 1398.3317 1400.3435 1409.3538 1418.5304 1448.7221 1449.6393 1465.3719 1465.9790 1471.4622 1478.5993 1479.3792 1481.5603 1483.9234 1487.1639 1492.1316 1492.8593 1555.7620 1629.8375 2975.4502 2979.9667 2983.0923 2989.9231 2993.5181 3005.8792 3036.7349 3052.1845 3056.0346 3069.8160 3076.4603 3076.8836 3081.2282 3081.7060 3085.6715 3089.0848 3111.7530 3158.7339 3246.4361
redmass: 3.7943 2.2219 2.5216 3.0531 1.8020 2.6531 2.6308 4.1107 2.7178 3.5984 5.1400 1.1019 1.3267 2.0121 2.2760 2.4039 2.6063 3.1963 4.0050 3.7992 2.9551 4.7513 3.5576 3.7455 5.8649 4.4791 5.5676 3.1698 3.6571 4.0309 4.5028 2.2783 8.5667 8.8813 3.1271 2.8823 2.1773 1.7978 1.4279 1.8561 3.7093 1.4531 1.7152 6.5593 2.0464 1.5013 1.7105 1.8186 1.4526 2.1330 1.6433 2.3191 1.8150 3.0017 2.1963 2.4274 2.5781 4.3015 1.9611 3.0963 1.4370 1.2292 3.0208 3.8087 1.3933 1.7799 4.8596 1.4360 2.9007 1.5977 1.3539 1.2903 1.2465 1.3893 2.1134 1.9585 2.9747 1.1750 1.2508 1.0815 1.2042 1.0566 1.3055 1.0522 1.0496 1.1673 1.0744 7.4436 8.3150 1.0387 1.0366 1.0362 1.0592 1.0415 1.0636 1.0995 1.0962 1.0978 1.0887 1.0979 1.0928 1.1003 1.0976 1.0999 1.0984 1.0992 1.0927 1.0977
irintensity: 1.8891 0.5811 0.2310 0.1622 1.2635 1.2194 0.8760 2.3030 1.6313 0.8224 4.3180 0.4440 0.3819 0.3039 0.2405 1.2716 0.6501 0.8215 1.3199 0.8430 0.8086 2.8222 1.6868 1.9171 1.9049 3.9054 3.3154 5.3820 4.0896 8.3383 1.0579 5.2234 1.2558 12.4947 1.8080 3.2615 1.5674 17.5131 11.0604 10.0667 6.3706 17.2107 14.5469 9.2400 11.0014 3.7860 21.1725 6.7743 7.9379 8.5157 3.3316 5.2815 21.2787 0.0791 0.3350 31.0558 1.3682 62.2222 6.1666 184.1610 29.8419 13.8662 8.2464 53.5726 13.0973 5.7962 80.4825 3.2010 85.3534 16.2620 20.0732 35.6121 3.4065 15.8873 17.8345 17.9309 40.3771 3.8103 14.7618 14.3782 36.6712 10.1661 18.0560 1.5831 10.8431 4.9751 9.3145 11.8899 2.4699 37.8996 23.5721 27.2849 23.1219 15.7937 15.9652 6.5542 20.3716 0.5994 6.6910 36.8843 16.4112 65.5848 44.3269 37.3659 17.9835 9.9937 5.8728 0.8378
temp: 298.150 k
press: 1.00000 atm
elementType: 8 8 7 7 7 6 6 6 6 6 6 6 6 6 6 6 6 6 6 1 1 1 1 1 1 1 1 1 1 1 1 1 1 1 1 1 1 1
symmnumber: 1
zpe: 815389.7 jmol-1
zpe.correction: 0.310566 hartree
zpe.thermalcorrener: 0.329981 hartree
zpe.thermalcorrenthalpy: 0.330925 hartree
zpe.thermalcorrgfe: 0.262337 hartree
zpe.sumelectzpe: -858.094857 hartree
zpe.sumelectthermal: -858.075442 hartree
zpe.sumelectthermalent: -858.074498 hartree
zpe.sumelectthermalfe: -858.143086 hartree
dipole: -0.3266 -0.6330 -0.3233
dipole: 0.7822
quadrupole: -88.3348 -131.7264 -115.3839
quadrupole: 0.1244 2.6781 -0.5638
quadrupole: 23.4803 -19.9114 -3.5689 0.1244 2.6781 -0.5638
hfenergy: -858.405423 hartree
pointgroup: C01 [X(C14H19N3O2)]
dipole: -0.1259866 0.2631075 0.0979956 debye
polarizability: 248.8367221|-2.3171739|194.3717161|10.8503768|-7.1405199|120.0342946 unknown
InChI: InChI=1S/C14H19N3O2/c1-5-11(6-2)16-8-15-12-7-9(3)10(4)13(14(12)16)17(18)19/h7-8,11H,5-6H2,1-4H3
charge 0 multiplicity 1
38 atoms
O  0.870048 -2.966021 0.88184
O  -0.388764 -2.354221 -0.916648
N  -1.111372 0.682522 -0.031859
N  -0.050778 2.727956 -0.078263
N  0.490551 -2.097422 0.003016
C  -2.283041 -0.250833 0.024957
C  0.271153 0.407337 -0.040521
C  -3.309393 0.249435 1.077326
C  -2.871567 -0.502794 -1.392752
C  0.909882 1.69708 -0.053668
C  1.091814 -0.753264 0.028614
C  -1.224167 2.083336 -0.064972
C  2.510648 -0.645844 0.08383
C  -4.417415 -0.788476 1.35606
C  -3.569935 0.700306 -2.060351
C  3.116177 0.658423 0.062886
C  2.312306 1.814299 -0.005699
C  3.406392 -1.872569 0.125812
C  4.627939 0.808462 0.108973
H  -1.896181 -1.216291 0.389491
H  -3.775558 1.198783 0.752473
H  -2.763784 0.468408 2.015627
H  -3.5873 -1.342452 -1.305165
H  -2.050512 -0.869236 -2.03359
H  -2.191362 2.578189 -0.064907
H  -5.077903 -0.439855 2.169974
H  -3.98729 -1.759741 1.664315
H  -5.048208 -0.964626 0.466541
H  -2.873936 1.544247 -2.216668
H  -4.430219 1.066045 -1.469473
H  -3.954795 0.407053 -3.053653
H  2.763199 2.811362 -0.015981
H  2.93364 -2.767351 -0.307055
H  4.346456 -1.68444 -0.41765
H  3.667264 -2.131083 1.169449
H  4.909622 1.870678 0.199787
H  5.07053 0.266645 0.96483
H  5.109657 0.414952 -0.806926
