program: Gaussian 09
title: 000155963
version: EM64L-G09RevD.01
frameworkgroup: C1[X(C20H32O3)]
method: RPBEPBE
basis: SDD
operation: Freq
keyword: #pfreq=noraman
keyword: PBEPBE/SDD
title: #p freq=noraman PBEPBE/SDD
converged: YES YES NO NO
title: Mulliken charges:
elementType: O O O C C C C C C C C C C C C C C C C C C C C H H H H H H H H H H H H H H H H H H H H H H H H H H H H H H H H
charge: -0.430038 -0.435033 -0.264428 -0.383277 -0.385757 -0.361503 -0.381445 -0.444097 -0.373189 -0.077609 -0.353276 -0.511867 -0.356710 -0.696424 -0.169126 -0.229113 -0.201166 -0.226737 -0.193517 -0.215799 -0.136306 -0.329430 0.154206 0.192234 0.191549 0.195725 0.194066 0.192498 0.217314 0.191622 0.191979 0.222528 0.194449 0.189864 0.190126 0.218006 0.187540 0.187757 0.195192 0.240682 0.194917 0.195033 0.209491 0.215344 0.209780 0.323836 0.228983 0.231649 0.226151 0.228932 0.228354 0.230872 0.258179 0.252970 0.374021
chargesum: 0.00000
title: Mulliken charges with hydrogens summed into heavy atoms:
elementType: O O O C C C C C C C C C C C C C C C C C C C C
charge: -0.106203 -0.061013 -0.264428 0.000506 0.004033 0.048309 0.002157 -0.027121 0.006802 0.140398 0.022022 -0.075992 0.033240 -0.061811 0.059857 0.002535 0.024985 0.002195 0.034838 0.015072 0.121873 -0.076461 0.154206
polarizability: 4.79441358e+02 -1.87952038e+02 3.27854051e+02 -1.59177763e+01 1.35138367e+01 1.90427390e+02
1716.lowfreq: -2.9343 -0.0007 0.0004 0.0014 2.6508 6.1723 16.6236 20.2205 29.8759
frequency: 10.0331 20.1875 29.8569 30.3910 35.6989 37.3653 50.2944 60.8730 66.1727 82.7368 92.8760 107.9920 108.9657 115.5603 123.8294 141.0213 144.4373 154.6845 161.7400 189.8710 194.8676 216.1654 220.7255 232.0376 246.3128 270.4327 299.6959 306.8694 323.7522 336.7411 351.4464 367.7597 394.2058 429.5227 444.4236 459.3669 479.4652 494.1721 520.2982 569.8344 571.3388 577.9559 622.8827 687.7552 721.6650 726.0891 737.6292 762.5307 794.5640 810.0095 842.3558 858.6789 878.2624 887.2335 894.7938 911.5628 915.3779 919.9484 922.9131 954.9983 956.8748 979.0029 996.8002 1000.0425 1004.4143 1019.7377 1028.0691 1041.6249 1042.2120 1045.1431 1063.7067 1079.2404 1086.6579 1093.5976 1094.7795 1108.9607 1122.3022 1145.0651 1159.3849 1175.9737 1183.5220 1200.8809 1206.0037 1209.2361 1218.1698 1232.9939 1237.6412 1251.1368 1254.1455 1262.7222 1271.8797 1278.4081 1281.4535 1283.1821 1283.8943 1288.3066 1293.3633 1294.8778 1295.6797 1302.8289 1305.9813 1311.4864 1326.5268 1333.9277 1348.4010 1356.4446 1358.9527 1361.7519 1364.8861 1372.7370 1386.4610 1453.6420 1455.4588 1461.0597 1461.6335 1464.7279 1468.3376 1474.6226 1477.1244 1480.9217 1486.3880 1489.0700 1568.5270 1589.7683 1629.9724 1632.8453 1651.3478 2942.3625 2948.5730 2949.7557 2950.5007 2954.5608 2960.7559 2964.4980 2967.2814 2968.9879 2971.0901 2982.1115 2987.0300 2995.3808 3005.2375 3010.6110 3018.2360 3024.6814 3034.2945 3038.2571 3046.6761 3067.8167 3069.8568 3073.7248 3080.6081 3083.1339 3089.6261 3094.0147 3099.7453 3107.3776 3157.3255 3525.6065 3541.6097
redmass: 5.5110 4.1843 5.3394 4.6198 4.2271 1.8297 3.9327 3.5317 2.8920 2.1277 3.6789 2.9015 3.1857 2.7051 2.0572 2.4829 2.2354 2.2880 4.0821 5.3919 3.6552 3.8083 3.0770 1.1131 2.4682 3.1285 2.1472 1.4379 2.8988 3.0609 3.8116 3.1945 2.7439 2.7675 3.1892 3.4724 3.8738 2.6949 3.0177 3.6568 3.2176 1.2083 4.2137 3.7284 1.0601 1.0742 1.1179 1.2249 1.5924 1.2999 1.6974 1.6577 1.5824 1.8896 1.8252 1.8141 1.5667 1.5342 5.7046 1.2035 1.3146 3.7614 1.2768 3.5029 2.1891 1.2752 1.1044 2.1685 3.2265 2.3177 1.6587 2.4696 2.2275 2.1170 2.3660 1.9700 2.4940 1.8751 1.5694 1.7802 1.8422 1.9533 1.4751 1.4425 1.3283 1.3552 1.3483 1.2979 1.2998 1.5609 1.3226 1.3133 1.4137 1.4815 1.0845 1.1362 1.1893 1.2166 1.1086 1.2907 1.3075 1.5314 1.4860 1.4340 1.4866 1.6719 1.6210 1.6321 1.2452 1.7406 1.2162 1.0858 1.0967 1.0722 1.0723 1.0660 1.0797 1.0798 1.0424 1.0844 1.0902 1.0950 5.4572 5.0788 6.0290 6.4377 5.6958 1.0641 1.0588 1.0587 1.0592 1.0594 1.0593 1.0583 1.0592 1.0605 1.0366 1.0961 1.0974 1.0996 1.0945 1.1000 1.0965 1.1039 1.0976 1.1014 1.1022 1.1007 1.0993 1.0922 1.0915 1.0919 1.0915 1.0902 1.0879 1.0880 1.0918 1.0640 1.0657
irintensity: 0.0628 0.0898 0.7675 0.7108 0.2583 0.0109 0.3779 0.3815 1.2022 0.4042 0.4209 0.2887 0.0881 0.2619 0.2469 0.7437 0.1736 0.4410 0.2430 0.2441 0.9405 1.7530 1.1680 0.0004 1.5761 0.1348 21.6435 85.1896 53.0015 15.6230 29.2790 6.3149 1.9616 3.0469 9.1349 7.6563 18.5426 6.8026 11.8421 14.9192 4.8641 129.1115 7.2698 43.0341 15.2217 0.2230 3.1986 2.2526 9.9352 3.5810 7.7670 16.7767 2.8891 8.2451 9.6609 18.0637 1.2947 5.0294 28.1217 1.1090 4.5226 81.8829 18.3862 13.0970 70.8547 58.0614 192.9841 906.6802 6.2021 46.1560 18.1635 5.8073 28.0701 0.3386 6.9882 28.8928 35.5701 0.4977 8.0330 0.4250 2.1858 13.0494 17.2240 24.6011 29.9138 1.3446 31.9093 8.0769 4.1798 40.0133 6.1214 1.2961 0.8941 0.8117 0.0988 1.7479 1.1922 0.9826 0.1361 0.9237 1.4005 21.3032 38.7746 20.6312 4.6190 3.8029 3.4023 5.3069 110.8671 63.1391 11.1314 7.6022 13.0372 0.0349 0.1439 0.1253 0.1574 1.6319 12.3117 0.8753 1.6675 32.4517 21.4162 1032.3489 95.0022 175.7365 17.3537 10.3439 2.6560 0.0583 2.6625 0.1938 30.3674 34.0973 38.0070 194.6014 34.5743 0.5611 1.1669 1.4137 10.1359 4.0026 3.1729 2.8202 35.7234 40.8279 208.8127 96.5087 56.1148 14.8567 4.3696 2.0059 8.6694 8.5596 54.3177 35.3886 7.4595 76.2703 14.6695
temp: 298.150 k
press: 1.00000 atm
elementType: 8 8 8 6 6 6 6 6 6 6 6 6 6 6 6 6 6 6 6 6 6 6 6 1 1 1 1 1 1 1 1 1 1 1 1 1 1 1 1 1 1 1 1 1 1 1 1 1 1 1 1 1 1 1 1
symmnumber: 1
zpe: 1244591.6 jmol-1
zpe.correction: 0.474040 hartree
zpe.thermalcorrener: 0.502245 hartree
zpe.thermalcorrenthalpy: 0.503190 hartree
zpe.thermalcorrgfe: 0.409492 hartree
zpe.sumelectzpe: -1005.148062 hartree
zpe.sumelectthermal: -1005.119857 hartree
zpe.sumelectthermalent: -1005.118913 hartree
zpe.sumelectthermalfe: -1005.212611 hartree
dipole: -2.9221 1.4116 -2.3412
dipole: 4.0016
quadrupole: -176.3742 -152.5990 -138.6929
quadrupole: 11.1090 -6.7205 -3.6187
quadrupole: -20.4855 3.2897 17.1958 11.1090 -6.7205 -3.6187
hfenergy: -1005.6221022 hartree
pointgroup: C01 [X(C20H32O3)]
dipole: 1.1426887 -0.5291813 -0.9448629 debye
polarizability: 479.0412458|-188.610912|329.0623775|8.3627815|-8.1486657|189.619175 unknown
InChI: InChI=1S/C20H32O3/c1-2-3-4-5-7-10-13-16-19(21)17-14-11-8-6-9-12-15-18-20(22)23/h6,8-9,11-12,14-15,18-19,21-22H,2-5,7,10,13,16-17H2,1H3
charge 0 multiplicity 1
55 atoms
O  2.77623 -4.897276 -0.191157
O  -9.281907 3.589316 -0.512343
O  -8.584941 2.867661 1.591667
C  4.07002 -0.639119 -0.332746
C  5.365279 -0.114793 0.327313
C  3.57178 -1.96779 0.277783
C  5.872476 1.209129 -0.287067
C  2.251867 -2.463608 -0.352054
C  7.160554 1.740731 0.38149
C  1.803935 -3.842916 0.17022
C  7.668271 3.064333 -0.233494
C  0.377319 -4.247484 -0.312756
C  8.953941 3.598688 0.438565
C  9.453028 4.922027 -0.180912
C  -0.718957 -3.418204 0.304288
C  -1.614325 -2.640737 -0.387506
C  -2.655207 -1.850596 0.240689
C  -3.56426 -1.065971 -0.445842
C  -4.590148 -0.282271 0.196089
C  -5.506822 0.512299 -0.473177
C  -6.518767 1.286507 0.201896
C  -7.444728 2.087511 -0.4305
C  -8.439883 2.841367 0.340079
H  4.244255 -0.777458 -1.420783
H  3.275925 0.131844 -0.24171
H  6.158555 -0.886642 0.242029
H  5.189396 0.029918 1.413911
H  3.42414 -1.835337 1.36996
H  4.34843 -2.749275 0.161322
H  6.056539 1.062842 -1.372235
H  5.07567 1.978418 -0.208752
H  1.445458 -1.729148 -0.154854
H  2.359065 -2.518309 -1.458427
H  6.9759 1.888556 1.466329
H  7.957675 0.971628 0.304833
H  1.827746 -3.853326 1.27602
H  7.856928 2.917179 -1.317781
H  6.870974 3.833558 -0.159297
H  0.330932 -4.185244 -1.419158
H  0.247772 -5.313405 -0.035016
H  9.750181 2.829956 0.363523
H  8.764572 3.744221 1.521865
H  9.67791 4.795443 -1.256929
H  10.372388 5.282287 0.316498
H  8.686675 5.715121 -0.090748
H  2.883293 -4.895871 -1.177443
H  -0.787796 -3.445935 1.404161
H  -1.552348 -2.60735 -1.486028
H  -2.715037 -1.88532 1.339746
H  -3.510622 -1.029165 -1.544385
H  -4.639756 -0.323354 1.295376
H  -5.468977 0.562505 -1.571344
H  -6.559733 1.239151 1.300534
H  -7.474531 2.191739 -1.519963
H  -9.938632 4.082069 0.049821
