program: Gaussian 09
title: 000155959
version: EM64L-G09RevD.01
frameworkgroup: C1[X(C16H15NO)]
method: RPBEPBE
basis: SDD
operation: Freq
keyword: #p
keyword: freq=noraman
keyword: PBEPBE/SDD
title: #p freq=noraman PBEPBE/SDD
converged: YES YES NO YES
title: Mulliken charges:
elementType: O N C C C C C C C C C C C C C C C C H H H H H H H H H H H H H H H
charge: -0.280135 -0.202949 -0.400958 -0.325277 -0.281726 0.221079 0.457988 0.302754 -0.375277 -0.385142 -0.377763 -0.377729 -0.225189 -0.220798 -0.262959 -0.239424 -0.231428 -0.250896 0.228903 0.246085 0.224675 0.220337 0.234271 0.240700 0.232890 0.217770 0.263306 0.224058 0.223211 0.229036 0.222209 0.222350 0.226028
chargesum: 0.00000
title: Mulliken charges with hydrogens summed into heavy atoms:
elementType: O N C C C C C C C C C C C C C C C C
charge: -0.280135 -0.202949 0.074029 0.119735 -0.047455 0.221079 0.457988 0.302754 -0.134576 -0.152252 -0.159993 -0.114423 -0.001131 0.002413 -0.033923 -0.017216 -0.009077 -0.024868
polarizability: 3.65547439e+02 5.55346044e+00 1.80634203e+02 8.63052903e+00 -3.76872514e+00 9.38134439e+01
1716.lowfreq: -7.9187 -5.4220 -2.5355 0.0001 0.0005 0.0005 27.6955 51.5263 58.7249
frequency: 27.6517 51.5204 58.7207 77.2154 99.9454 155.1669 177.5699 243.6834 255.2371 271.8709 315.8055 351.6253 401.8291 404.1410 412.6668 446.5556 495.0630 513.3851 523.2645 571.3381 600.1634 613.1402 617.6086 660.6785 693.6201 694.8394 754.2998 756.9830 767.4010 801.4722 812.5471 822.8266 847.5534 865.2125 883.2369 916.7561 937.1027 959.3919 975.0203 978.6480 979.6598 985.1983 993.4902 996.0411 1019.3494 1028.2279 1037.5408 1063.6564 1081.2907 1084.4237 1090.1977 1171.6514 1172.7376 1190.8575 1196.0262 1208.9336 1230.9169 1255.1590 1271.1580 1317.7628 1319.0397 1331.8782 1341.0113 1364.2993 1373.1455 1383.9856 1391.3429 1437.8752 1448.1811 1458.9895 1464.7209 1484.5981 1496.4070 1578.7573 1580.5355 1610.0525 1616.6720 1642.3003 2978.2329 2994.9962 3070.6672 3097.8853 3120.7307 3125.7809 3129.6005 3131.9096 3142.8601 3149.6416 3154.8659 3158.4851 3169.4847 3173.5674 3197.9639
redmass: 3.8617 4.0727 4.7339 4.5602 3.7255 4.3043 4.0568 3.5644 4.6271 3.2930 4.6463 3.6334 5.2967 2.8863 2.9564 3.8737 3.5702 3.2571 3.1904 6.4042 4.0193 6.2959 6.1616 5.3896 1.8929 1.8449 1.8520 3.0698 1.7991 1.4556 2.4730 1.4559 1.2545 2.9150 1.5660 1.4669 2.8151 1.3969 1.3834 3.8013 1.4109 5.7521 1.3338 4.3460 3.0561 2.1466 1.9628 4.1806 1.9959 1.6194 1.6038 1.0530 1.0506 1.1214 1.1260 1.2695 2.2265 1.6687 2.1663 1.3949 1.3577 1.3920 1.4202 1.6472 3.3307 4.7478 3.9038 2.3739 2.2964 1.1235 1.1438 2.2738 2.7451 5.7980 6.1784 6.0084 6.0824 7.3349 1.0665 1.0632 1.0981 1.1012 1.0845 1.0845 1.0879 1.0879 1.0940 1.0917 1.0955 1.0979 1.1012 1.0968 1.0910
irintensity: 0.1006 0.6791 0.1270 1.1688 7.6185 1.0528 2.4614 3.4143 0.7594 4.3416 1.0551 1.5771 4.1305 0.3296 3.1731 4.2283 5.8748 9.6603 8.4164 10.4012 7.6200 0.6120 0.7936 2.0896 41.9206 40.6908 71.6375 8.9448 96.7581 22.8963 7.0043 5.8156 1.1888 0.2861 4.5238 6.8369 23.4678 0.0232 0.1613 2.3133 1.1719 8.9139 0.9056 17.3496 22.3327 31.2053 3.0925 61.1331 0.8762 17.0170 5.4199 0.1053 0.6146 5.2552 5.0276 6.7172 191.6339 45.5058 86.6758 101.8324 14.6345 16.8182 7.0825 41.7373 52.8329 1.3899 51.5088 11.0749 1.1543 15.0953 29.7272 120.1334 144.8817 1.1787 19.9311 294.2070 98.1824 193.3260 44.3387 46.7670 19.7291 29.9129 7.4223 12.5536 4.7252 5.1824 37.1893 25.2995 32.7299 33.9407 16.7373 10.6113 9.6658
temp: 298.150 k
press: 1.00000 atm
elementType: 8 7 6 6 6 6 6 6 6 6 6 6 6 6 6 6 6 6 1 1 1 1 1 1 1 1 1 1 1 1 1 1 1
symmnumber: 1
zpe: 701654.7 jmol-1
zpe.correction: 0.267246 hartree
zpe.thermalcorrener: 0.281888 hartree
zpe.thermalcorrenthalpy: 0.282832 hartree
zpe.thermalcorrgfe: 0.224296 hartree
zpe.sumelectzpe: -747.387225 hartree
zpe.sumelectthermal: -747.372582 hartree
zpe.sumelectthermalent: -747.371638 hartree
zpe.sumelectthermalfe: -747.430175 hartree
dipole: -1.9396 1.0358 0.2139
dipole: 2.2093
quadrupole: -100.6072 -92.4210 -110.1477
quadrupole: -4.9981 2.4296 -0.3608
quadrupole: 0.4514 8.6377 -9.0891 -4.9981 2.4296 -0.3608
hfenergy: -747.6544707 hartree
pointgroup: C01 [X(C16H15N1O1)]
dipole: 0.7602626 -0.4131461 0.0824913 debye
polarizability: 365.4885389|3.9359682|180.6174223|-10.6038653|3.0089635|93.8891248 unknown
InChI: InChI=1S/C16H15NO/c1-3-7-14(8-4-1)16-13-17(11-12-18-16)15-9-5-2-6-10-15/h1-10,13H,11-12H2
charge 0 multiplicity 1
33 atoms
O  -1.275384 -2.014965 0.151853
N  1.264869 -0.664651 -0.154639
C  1.155548 -2.122531 -0.346416
C  -0.002531 -2.647324 0.528072
C  0.041595 0.027082 -0.055879
C  -1.183282 -0.598124 0.022177
C  2.520022 -0.013714 -0.058922
C  -2.494336 0.069834 -0.018562
C  2.642346 1.250127 0.591492
C  3.690512 -0.608057 -0.615052
C  -2.641152 1.420932 -0.451046
C  -3.664606 -0.643938 0.369796
C  3.892581 1.896046 0.666212
C  4.937524 0.042874 -0.51843
C  5.05255 1.301066 0.116677
C  -3.905804 2.041179 -0.461159
C  -4.930441 -0.021964 0.345652
C  -5.061137 1.325455 -0.06273
H  2.093496 -2.612197 -0.034066
H  0.959719 -2.37164 -1.408404
H  -0.155758 -3.728211 0.380744
H  0.210181 -2.437721 1.595045
H  0.092734 1.113787 -0.113488
H  1.771818 1.707172 1.072363
H  3.624471 -1.557577 -1.156248
H  -1.769585 1.984097 -0.803455
H  -3.562859 -1.685042 0.688439
H  3.962892 2.863668 1.176249
H  5.822268 -0.431356 -0.958521
H  6.022171 1.804896 0.183456
H  -3.994787 3.080832 -0.796789
H  -5.817283 -0.590525 0.648507
H  -6.044553 1.807988 -0.080728
