program: Gaussian 09
title: 000155956
version: EM64L-G09RevD.01
frameworkgroup: C1[X(C11H15N2O)]
method: RPBEPBE
basis: SDD
operation: Freq
keyword: #p
keyword: freq=noraman
keyword: PBEPBE/SDD
title: #p freq=noraman PBEPBE/SDD
converged: YES YES NO NO
title: Mulliken charges:
elementType: O N N C C C C C C C C C C C H H H H H H H H H H H H H H H
charge: -0.206877 -0.196191 -0.058589 -0.216504 -0.457324 -0.512791 0.463134 0.162839 -0.619878 -0.284113 -0.281098 -0.143539 -0.162052 -0.584591 0.272348 0.272115 0.241417 0.246260 0.291038 0.251654 0.215816 0.290071 0.320308 0.290377 0.281158 0.291562 0.277441 0.292060 0.263947
chargesum: 1.00000
title: Mulliken charges with hydrogens summed into heavy atoms:
elementType: O N N C C C C C C C C C C C
charge: -0.206877 -0.196191 -0.058589 0.055844 0.056208 0.024507 0.463134 0.162839 0.137663 0.036196 0.009280 0.137619 0.129510 0.248857
polarizability: 1.61416330e+02 -6.40906438e+00 1.30447331e+02 3.32270039e+00 -5.63284021e+00 9.35480481e+01
1716.lowfreq: -19.2415 -8.4722 -6.7236 0.0002 0.0005 0.0008 9.5994 31.2940 50.3180
frequency: 8.7531 30.2675 50.1878 78.1648 138.8886 151.3219 156.1802 197.3203 211.2868 267.6405 288.3278 345.3651 401.1068 425.4140 469.5287 528.5835 530.7801 564.6657 574.7066 634.5260 660.5359 692.3329 724.2357 782.0137 819.4684 838.6395 893.1128 925.5634 945.9842 953.1772 977.2457 1009.8120 1016.1464 1028.0440 1039.3706 1069.1224 1092.0939 1122.1080 1123.4492 1129.3482 1136.0279 1156.4054 1181.1016 1203.7643 1209.5316 1233.6671 1258.2705 1273.8854 1296.7807 1314.5109 1331.2574 1358.2910 1376.9932 1422.2356 1429.6864 1451.0650 1453.3966 1465.6996 1475.4134 1478.8661 1481.5208 1488.5074 1493.1007 1577.2680 1618.7127 1659.7673 2968.4682 2990.8671 3016.1029 3025.6078 3035.4740 3050.6494 3092.2559 3101.8710 3105.7958 3132.3382 3150.3096 3157.1849 3179.4077 3189.9875 3208.2767
redmass: 1.0244 3.6979 5.1034 3.6505 2.7527 1.0853 2.3758 3.0758 3.7807 2.9300 3.4116 5.6680 2.9652 2.9942 4.3421 4.8713 3.4530 3.4010 3.9638 4.5421 5.0117 2.2969 4.0237 2.5205 1.5246 2.5131 2.3761 1.6160 2.5511 1.3126 2.5383 1.3988 5.0920 2.4002 2.5748 1.7354 1.8826 1.3277 1.3588 1.5497 1.3594 1.5479 1.4673 1.2468 1.6378 2.8521 2.0740 1.6615 1.6353 1.4262 1.5036 4.2446 2.1567 1.3322 1.1808 1.5002 1.0890 1.2313 1.0964 1.0478 1.1694 1.1096 1.8078 5.3434 5.2429 10.5132 1.0366 1.0845 1.0664 1.0339 1.0623 1.0999 1.1005 1.0990 1.1021 1.1034 1.1044 1.0929 1.0946 1.0928 1.1009
irintensity: 0.3621 1.3969 3.6751 1.6535 1.8879 0.4732 2.2719 2.6078 6.1668 1.2536 5.1149 7.0813 0.4780 5.2107 3.6871 1.4393 1.3752 6.0843 0.2792 9.5817 8.0950 26.5422 3.8136 9.9735 36.6384 12.1566 6.3578 3.4204 1.5450 1.3066 8.4346 0.3822 1.7681 8.6727 4.8248 1.0770 56.7360 3.0413 2.5666 4.6957 3.5198 23.2426 36.9410 5.8775 35.8592 28.2951 18.5609 25.7727 17.7408 6.9385 15.7781 32.6194 23.6766 12.7320 53.1493 11.1473 9.2674 15.3641 13.0271 19.8291 19.4928 16.7202 80.6212 3.2668 24.1207 277.4167 43.1248 16.9200 8.5527 0.8880 16.1417 30.8686 4.2908 0.1506 13.9462 1.3392 1.4810 0.1949 5.0901 1.3479 2.2139
temp: 298.150 k
press: 1.00000 atm
elementType: 8 7 7 6 6 6 6 6 6 6 6 6 6 6 1 1 1 1 1 1 1 1 1 1 1 1 1 1 1
symmnumber: 1
zpe: 640750.6 jmol-1
zpe.correction: 0.244049 hartree
zpe.thermalcorrener: 0.257659 hartree
zpe.thermalcorrenthalpy: 0.258603 hartree
zpe.thermalcorrgfe: 0.200991 hartree
zpe.sumelectzpe: -611.629991 hartree
zpe.sumelectthermal: -611.616381 hartree
zpe.sumelectthermalent: -611.615437 hartree
zpe.sumelectthermalfe: -611.673049 hartree
dipole: 10.3531 -1.7880 0.5069
dipole: 10.5185
quadrupole: -53.8780 -63.4339 -74.9315
quadrupole: 14.7058 -5.0059 -0.9695
quadrupole: 10.2031 0.6472 -10.8503 14.7058 -5.0059 -0.9695
hfenergy: -611.8740398 hartree
pointgroup: C01 [X(C11H15N2O1)]
dipole: -4.0977987 0.5748929 0.0563656 debye
polarizability: 161.9090359|-5.7239117|130.8113034|-1.7744292|-0.7138702|92.6913704 unknown
InChI: InChI=1S/C11H15N2O/c1-12-7-3-4-9(8-12)10-5-6-11(14)13(10)2/h3-4,7-8,10H,5-6H2,1-2H3
charge 1 multiplicity 1
29 atoms
O  3.320332 -1.464189 -0.205841
N  1.740717 0.025128 0.715408
N  -2.253148 -1.034656 -0.110809
C  0.874606 1.133967 0.305377
C  1.492841 1.586151 -1.073848
C  2.245723 0.336736 -1.587496
C  -0.594758 0.715798 0.16755
C  2.539317 -0.489361 -0.325776
C  1.846079 -0.444543 2.101741
C  -0.944431 -0.642724 0.057613
C  -1.63934 1.676143 0.112838
C  -2.976415 1.258919 -0.057266
C  -3.267591 -0.109231 -0.170229
C  -2.570076 -2.497039 -0.191537
H  0.921485 1.964375 1.037299
H  2.203606 2.406571 -0.880382
H  0.728499 1.958475 -1.775513
H  1.648156 -0.272301 -2.291324
H  3.1913 0.5794 -2.0968
H  2.174293 0.370353 2.77266
H  0.886921 -0.847461 2.481414
H  2.601058 -1.248086 2.121538
H  -0.188583 -1.430833 0.105315
H  -1.406973 2.742803 0.20347
H  -3.796437 1.979059 -0.10391
H  -4.281949 -0.490369 -0.302382
H  -1.782514 -3.012507 -0.760938
H  -2.62889 -2.917788 0.82548
H  -3.532331 -2.63719 -0.704652
