program: Gaussian 09
title: 000155937
version: EM64L-G09RevD.01
frameworkgroup: C1[X(C16H18O4)]
method: RPBEPBE
basis: SDD
operation: Freq
keyword: #pfreq=noraman
keyword: PBEPBE/SDD
title: #p freq=noraman PBEPBE/SDD
converged: YES YES NO NO
title: Mulliken charges:
elementType: O O O O C C C C C C C C C C C C C C C C H H H H H H H H H H H H H H H H H H
charge: -0.260987 -0.271464 -0.282182 -0.207166 0.277047 -0.008140 -0.585727 0.502096 0.036783 0.230313 -0.609098 -0.305665 -0.281229 0.386246 -0.315381 0.118239 -0.798550 -0.790705 -0.501157 -0.533547 0.235423 0.240217 0.250688 0.226344 0.241840 0.250581 0.266780 0.215078 0.214814 0.222592 0.215767 0.218112 0.254144 0.218757 0.231589 0.246081 0.228150 0.223317
chargesum: 0.00000
title: Mulliken charges with hydrogens summed into heavy atoms:
elementType: O O O O C C C C C C C C C C C C C C C C
charge: -0.260987 -0.271464 -0.282182 -0.207166 0.277047 -0.008140 -0.110086 0.502096 0.036783 0.230313 -0.358410 -0.079321 -0.039389 0.386246 -0.064801 0.118239 -0.101879 -0.134233 0.203332 0.164000
polarizability: 2.68562882e+02 3.47476288e+01 2.32967211e+02 -4.44240713e+00 1.12977950e+01 1.14744923e+02
1716.lowfreq: -4.2864 -2.1791 0.0002 0.0005 0.0006 7.3602 20.9164 24.1712 39.9133
frequency: 20.7347 24.0851 39.8960 56.4324 63.7388 78.2926 102.9206 111.3423 138.9331 144.5768 171.0995 173.6861 177.9657 185.8901 212.6162 258.8226 260.0848 292.3637 309.9808 345.3935 352.6000 375.5147 391.8157 398.1128 428.6948 441.1000 458.0650 471.9414 496.5369 553.1430 569.5992 602.1893 611.1614 646.8355 684.0183 708.2872 727.2394 759.4126 787.5476 812.4892 813.7173 846.0481 859.7007 864.8158 926.5775 932.8322 950.5449 983.2173 984.9032 991.6711 1020.9697 1040.6256 1065.9816 1082.8523 1103.7473 1109.2980 1113.5656 1114.9753 1146.4004 1159.3028 1173.6209 1185.0322 1226.0421 1239.5478 1241.5937 1295.2257 1299.3579 1349.2414 1386.6267 1387.9057 1399.3530 1401.8038 1416.4166 1434.7351 1445.8992 1451.9422 1453.7383 1455.5155 1466.6472 1467.7466 1468.1961 1470.4842 1471.2551 1482.0765 1485.0193 1549.5049 1597.4090 1615.3155 1679.9657 1690.9971 2956.7562 2962.1930 2966.1261 2991.4861 3015.1308 3028.8910 3033.8822 3051.5648 3075.4731 3083.5025 3101.3503 3102.1440 3110.4782 3126.9700 3129.3091 3131.8260 3158.8809 3186.8659
redmass: 2.4564 2.7958 3.5924 2.7695 5.3866 2.4591 3.0607 1.1341 3.1160 2.4248 3.0120 2.3503 2.4264 2.9628 2.9550 1.9736 1.5798 3.6488 4.8877 3.2176 3.5900 3.6403 3.8779 3.7043 4.3789 4.0000 4.0081 3.9081 3.2758 4.4281 5.2294 5.1146 4.1589 4.8025 5.7392 7.1931 5.5709 3.0711 2.5650 3.1507 2.0050 4.3336 1.7656 1.9825 4.4078 3.0180 1.3807 1.3310 3.7935 1.2660 2.6117 5.3893 2.8269 1.6744 2.0659 1.6740 1.2781 2.3389 1.3969 1.4162 1.6075 1.7240 1.5385 1.7588 2.6071 1.5510 2.4067 1.4787 2.9433 1.2652 4.5204 1.2298 2.6569 1.3945 1.3838 1.1084 1.0887 1.0697 1.0593 1.1712 1.1220 1.2101 1.0856 1.5965 1.0792 9.9749 6.9973 7.0912 10.5742 6.3851 1.0369 1.0328 1.0403 1.0316 1.0638 1.0968 1.0957 1.1041 1.0983 1.0905 1.0965 1.0998 1.0951 1.0997 1.0905 1.1057 1.0907 1.0952
irintensity: 3.6722 3.7867 3.3244 1.3067 1.2422 0.4488 10.3108 1.3721 1.2860 2.4340 5.2758 0.2455 0.8532 2.0074 0.8996 0.9858 0.3605 4.0298 4.1335 1.0273 2.9939 2.2492 4.4547 5.2959 0.9564 1.6524 9.3846 1.1805 0.5643 8.5953 14.2241 12.4903 6.7632 0.9820 21.7004 11.3979 3.3419 6.5300 10.5963 3.0219 4.4375 25.5293 66.5015 39.8527 6.5700 7.1987 0.5191 0.4881 76.7147 3.5032 32.4410 134.3214 3.3251 2.2336 43.0403 52.4332 0.8684 13.6488 4.4171 12.9556 29.5369 44.5076 52.3020 9.0135 21.1586 75.5561 237.9523 2.0343 136.2475 25.2210 17.3102 13.7514 30.8391 8.1333 24.7972 7.6365 12.6543 0.5590 19.1022 35.1032 49.4138 60.1116 28.9661 6.7609 12.9746 169.2545 44.5837 65.2363 512.6895 16.0213 42.0922 64.0148 49.5798 76.6763 15.7700 11.5364 41.9696 42.5423 22.6239 16.6091 24.2070 28.4404 20.1724 21.9086 13.4468 17.9524 7.7018 2.7973
temp: 298.150 k
press: 1.00000 atm
elementType: 8 8 8 8 6 6 6 6 6 6 6 6 6 6 6 6 6 6 6 6 1 1 1 1 1 1 1 1 1 1 1 1 1 1 1 1 1 1
symmnumber: 1
zpe: 792274.5 jmol-1
zpe.correction: 0.301761 hartree
zpe.thermalcorrener: 0.322492 hartree
zpe.thermalcorrenthalpy: 0.323436 hartree
zpe.thermalcorrgfe: 0.250631 hartree
zpe.sumelectzpe: -919.877436 hartree
zpe.sumelectthermal: -919.856705 hartree
zpe.sumelectthermalent: -919.855761 hartree
zpe.sumelectthermalfe: -919.928566 hartree
dipole: -7.2577 -0.6008 2.8171
dipole: 7.8084
quadrupole: -110.1653 -109.4431 -119.6056
quadrupole: -13.8914 -2.5747 2.7154
quadrupole: 2.9060 3.6282 -6.5342 -13.8914 -2.5747 2.7154
hfenergy: -920.1791972 hartree
pointgroup: C01 [X(C16H18O4)]
dipole: 2.7818301 0.3312366 1.2607025 debye
polarizability: 263.3585326|36.2892038|238.0869928|14.3070422|-1.3315214|114.8294908 unknown
InChI: InChI=1S/C16H18O4/c1-10(2)5-7-12-15-11(6-8-14(17)20-15)9-13(18-3)16(12)19-4/h5-6,8-9H,7H2,1-4H3
charge 0 multiplicity 1
38 atoms
O  -1.461478 -1.365228 -0.672619
O  1.589545 2.310913 -0.654591
O  3.681165 0.664295 0.345082
O  -3.035421 -3.051153 -0.730973
C  0.085627 0.4725 -0.630558
C  -0.171877 -0.896628 -0.380909
C  -1.001977 1.398157 -1.163591
C  0.815494 -1.772889 0.152479
C  1.382805 0.9672 -0.337169
C  2.409687 0.090656 0.166986
C  2.11259 -1.256137 0.422448
C  -1.649713 2.210737 -0.047796
C  0.44871 -3.150333 0.381865
C  -2.925991 2.102734 0.422001
C  -0.819208 -3.615906 0.101129
C  -1.859751 -2.74994 -0.442682
C  -3.958953 1.111194 -0.08435
C  -3.415688 3.0196 1.53374
C  2.43606 3.172118 0.198292
C  4.758621 -0.218221 0.799176
H  -0.541018 2.095622 -1.886257
H  -1.753663 0.797035 -1.697423
H  2.875354 -1.935686 0.813943
H  -0.98962 2.963875 0.408262
H  1.202076 -3.835207 0.789712
H  -1.108696 -4.655737 0.271149
H  -3.537847 0.342813 -0.750617
H  -4.432377 0.583153 0.766544
H  -4.774302 1.635682 -0.622425
H  -2.641185 3.74286 1.843932
H  -4.310242 3.589673 1.2121
H  -3.719232 2.433297 2.424143
H  3.503382 2.973147 0.0213
H  2.200634 3.015931 1.266791
H  2.169306 4.197051 -0.102711
H  5.653702 0.41938 0.841705
H  4.92323 -1.046551 0.083267
H  4.545549 -0.629506 1.805024
