program: Gaussian 09
title: 000155902
version: EM64L-G09RevD.01
frameworkgroup: C1[X(C11H18)]
method: RPBEPBE
basis: SDD
operation: Freq
keyword: #p
keyword: freq=noraman
keyword: PBEPBE/SDD
title: #p freq=noraman PBEPBE/SDD
converged: YES YES NO NO
title: Mulliken charges:
elementType: C C C C C C C C C C C H H H H H H H H H H H H H H H H H H
charge: 0.185635 0.331739 -0.282489 -0.531108 -0.449343 0.415408 -0.431315 -0.832044 -0.796232 -0.757517 -0.855060 0.237432 0.221536 0.221879 0.219698 0.218443 0.240657 0.213589 0.217648 0.219437 0.214849 0.212635 0.235301 0.205442 0.241758 0.203831 0.229386 0.225835 0.222971
chargesum: 0.00000
title: Mulliken charges with hydrogens summed into heavy atoms:
elementType: C C C C C C C C C C C
charge: 0.185635 0.331739 -0.045056 -0.087693 -0.011202 0.415408 -0.190658 -0.181371 -0.133448 -0.106486 -0.176869
polarizability: 1.17632673e+02 -3.51734380e+00 1.08844119e+02 9.18209866e-01 -4.08745184e+00 1.04936341e+02
1716.lowfreq: -29.8417 -21.1938 0.0003 0.0004 0.0008 12.0189 129.6890 138.2987 176.1872
frequency: 129.6639 138.2710 176.1720 187.4849 204.6214 227.1983 237.5894 248.8295 279.4944 308.6716 350.4685 382.8794 420.5779 443.8793 493.4738 531.0571 553.7993 620.1560 641.3896 721.4570 753.3336 799.6105 827.7499 843.9125 872.7323 904.8239 930.9990 932.7972 939.3393 975.0226 983.4441 993.7963 1011.8104 1037.3140 1073.0560 1100.0745 1122.7091 1137.0510 1163.4778 1189.2566 1199.4107 1204.9515 1215.3500 1224.3227 1263.1495 1278.4156 1291.1423 1315.6049 1371.1153 1384.5400 1391.1259 1396.2383 1456.6611 1458.1383 1459.7742 1466.3423 1473.4581 1477.2614 1482.3051 1484.3054 1491.7275 1497.7603 1642.9549 2955.2070 2969.8663 2972.7028 2978.5807 2995.4144 3011.7556 3024.5017 3049.9472 3050.7503 3055.4272 3058.9957 3060.8531 3062.1931 3072.5561 3075.2050 3094.8055 3098.5910 3155.3479
redmass: 2.4489 1.0929 1.0415 1.2862 1.5351 1.1999 2.4281 2.0056 2.8306 1.9309 2.2179 2.4941 2.4910 2.4533 3.0501 3.2783 3.7817 3.3355 3.4194 2.9943 2.3450 1.5050 1.4227 2.5794 2.3015 2.1128 1.8435 1.4912 1.8025 1.9626 1.5531 1.6175 1.3283 1.5247 1.2563 1.5878 2.2444 2.0823 1.9945 2.0890 1.4897 1.8873 2.6431 1.5349 1.8170 2.1682 1.6849 3.0740 1.2171 1.2425 1.2348 1.2317 1.0549 1.0551 1.0599 1.0610 1.0506 1.0586 1.0722 1.0569 1.0735 1.0570 6.7911 1.0378 1.0361 1.0376 1.0380 1.0592 1.0628 1.0957 1.1005 1.1010 1.0978 1.0964 1.0907 1.0986 1.0977 1.1041 1.0964 1.0961 1.0975
irintensity: 1.3075 0.1332 0.0481 0.0453 0.1488 0.0962 0.3586 0.1571 0.6549 0.5011 0.6088 0.4070 0.8228 1.0319 0.4248 1.8259 1.9180 2.4446 1.3504 3.7053 2.6354 21.3761 4.5661 1.2163 5.6068 4.3787 3.3265 2.2354 0.5161 0.6626 4.6512 1.6436 4.6756 4.6720 3.9466 8.0053 9.3118 7.7241 0.6202 1.2843 0.3857 3.4501 1.7990 0.6801 3.6930 3.5204 4.8487 2.6098 21.2358 9.5827 29.6152 14.2365 15.5889 4.1302 9.7086 5.8666 9.9349 7.5580 7.5533 2.9217 10.2583 7.3818 3.5059 38.2160 33.3912 26.6484 56.1921 39.2734 57.6662 20.7097 1.8743 5.2126 33.4969 23.2491 79.9863 33.7602 23.6341 67.7313 39.7328 23.3806 19.9912
temp: 298.150 k
press: 1.00000 atm
elementType: 6 6 6 6 6 6 6 6 6 6 6 1 1 1 1 1 1 1 1 1 1 1 1 1 1 1 1 1 1
symmnumber: 1
zpe: 679228.9 jmol-1
zpe.correction: 0.258705 hartree
zpe.thermalcorrener: 0.270321 hartree
zpe.thermalcorrenthalpy: 0.271265 hartree
zpe.thermalcorrgfe: 0.223286 hartree
zpe.sumelectzpe: -429.073418 hartree
zpe.sumelectthermal: -429.061802 hartree
zpe.sumelectthermalent: -429.060858 hartree
zpe.sumelectthermalfe: -429.108837 hartree
dipole: 0.1130 -0.0743 0.3692
dipole: 0.3932
quadrupole: -67.4981 -69.4530 -69.9324
quadrupole: -0.3129 0.1879 -1.1300
quadrupole: 1.4630 -0.4918 -0.9712 -0.3129 0.1879 -1.1300
hfenergy: -429.3321231 hartree
pointgroup: C01 [X(C11H18)]
dipole: 0.040626 0.0272877 -0.1467661 debye
polarizability: 117.5010208|3.4985529|108.7848247|-1.2314323|-4.2473922|105.1272872 unknown
InChI: InChI=1S/C11H18/c1-8-7-9-5-6-11(8,4)10(9,2)3/h7,9H,5-6H2,1-4H3
charge 0 multiplicity 1
29 atoms
C  0.24152 0.459535 -0.585114
C  -1.00304 0.373491 0.406217
C  -0.675625 -1.121588 0.790526
C  -0.066683 -0.755028 -1.558048
C  -0.712961 -1.83188 -0.619704
C  1.372282 -0.084732 0.32198
C  0.810102 -1.020877 1.141508
C  0.494359 1.792946 -1.291043
C  -2.380764 0.577607 -0.268405
C  -0.927709 1.351278 1.604007
C  2.81956 0.297606 0.17938
H  -1.32733 -1.583587 1.550198
H  0.859691 -1.113974 -2.040923
H  -0.757904 -0.442354 -2.362698
H  -1.749618 -2.06868 -0.921449
H  -0.144433 -2.777344 -0.604113
H  1.332329 -1.671012 1.849778
H  1.375525 1.735599 -1.957755
H  -0.371685 2.081433 -1.915573
H  0.677691 2.60977 -0.567978
H  -3.191018 0.336899 0.446192
H  -2.511839 1.635367 -0.56582
H  -2.532931 -0.042816 -1.165808
H  -1.751116 1.1468 2.314775
H  0.024545 1.268112 2.151986
H  -1.042577 2.397558 1.261382
H  3.454602 -0.251701 0.896608
H  2.972538 1.381824 0.347516
H  3.197588 0.082451 -0.84082
